« part of build 5044  

Details for job e535036d-c809-47ca-a6ed-270a61de3374

failed

Name Linux x86_64 - system libs, clang
Success failed
Build Time 00:16:51
Git Head e412dcc57fd81a9807c108fc8b87c7cbde70602f
PR 17453
Worker # 5
Base Image ubuntu1804_full_base

Pull request info

Pull# 17453
Title
Head
Mergable
Changes
Comments
User

Tasks time consumption

00:00:15 - GIT_CHECKOUT
00:12:04 - APT_INSTALL
00:00:01 - RESTORE_CACHE
00:00:20 - CONFIGURE
00:03:37 - COMPILE_AND_INSTALL
00:00:02 - UPDATE_CCACHE_CACHE

Build log tail

      + mv /mnt/shared/cache/300ae86c82e3686b18e84030587771d8_ccache_x86_64-unknown-linux-gnu-syslibs.tar /mnt/shared/cache/DEL_300ae86c82e3686b18e84030587771d8_ccache_x86_64-unknown-linux-gnu-syslibs_e535036d-c809-47ca-a6ed-270a61de3374

real    0m0.005s
user    0m0.001s
sys     0m0.000s
+ mv /mnt/shared/cache/300ae86c82e3686b18e84030587771d8_ccache_copy_x86_64-unknown-linux-gnu-syslibs.tar /mnt/shared/cache/300ae86c82e3686b18e84030587771d8_ccache_x86_64-unknown-linux-gnu-syslibs.tar

real    0m0.005s
user    0m0.001s
sys     0m0.000s
+ timeblock_end UPDATE_CCACHE_CACHE
++ date +%s
+ echo -e '\n###END#UPDATE_CCACHE_CACHE#1579023136\n\n\n'

###END#UPDATE_CCACHE_CACHE#1579023136



+ '[' true = true ']'
+ timeblock_start RUN_UNIT_TESTS
++ date +%s
+ echo -e '\n###START#RUN_UNIT_TESTS#1579023136\n'

###START#RUN_UNIT_TESTS#1579023136

+ make -j4 check VERBOSE=1
Making check in src
make[1]: Entering directory '/home/ubuntu/src/src'
make[2]: Entering directory '/home/ubuntu/src/src'
make  check-TESTS check-local
make[3]: Entering directory '/home/ubuntu/src/src'
Running tests: amount_tests from test/amount_tests.cpp
Running tests: arith_uint256_tests from test/arith_uint256_tests.cpp
Running tests: addrman_tests from test/addrman_tests.cpp
AddressSanitizer: failed to parse suppressions
Makefile:15790: recipe for target 'test/arith_uint256_tests.cpp.test' failed
make[3]: *** [test/arith_uint256_tests.cpp.test] Error 1
make[3]: *** Waiting for unfinished jobs....
AddressSanitizer: failed to parse suppressions
Makefile:15790: recipe for target 'test/addrman_tests.cpp.test' failed
make[3]: *** [test/addrman_tests.cpp.test] Error 1
AddressSanitizer: failed to parse suppressions
Makefile:15790: recipe for target 'test/amount_tests.cpp.test' failed
make[3]: *** [test/amount_tests.cpp.test] Error 1
make[4]: Entering directory '/home/ubuntu/src/src'
FAIL: qt/test/test_bitcoin-qt
==============================================
   Bitcoin Core 0.19.99: src/test-suite.log
==============================================

# TOTAL: 1
# PASS:  0
# SKIP:  0
# XFAIL: 0
# FAIL:  1
# XPASS: 0
# ERROR: 0

.. contents:: :depth: 2

FAIL: qt/test/test_bitcoin-qt
=============================

AddressSanitizer: failed to parse suppressions
FAIL qt/test/test_bitcoin-qt (exit status: 1)

============================================================================
Testsuite summary for Bitcoin Core 0.19.99
============================================================================
# TOTAL: 1
# PASS:  0
# SKIP:  0
# XFAIL: 0
# FAIL:  1
# XPASS: 0
# ERROR: 0
============================================================================
See src/test-suite.log
Please report to https://github.com/bitcoin/bitcoin/issues
============================================================================
Makefile:15325: recipe for target 'test-suite.log' failed
make[4]: *** [test-suite.log] Error 1
make[4]: Leaving directory '/home/ubuntu/src/src'
Makefile:15431: recipe for target 'check-TESTS' failed
make[3]: *** [check-TESTS] Error 2
make[3]: Leaving directory '/home/ubuntu/src/src'
Makefile:15530: recipe for target 'check-am' failed
make[2]: *** [check-am] Error 2
make[2]: Leaving directory '/home/ubuntu/src/src'
Makefile:15218: recipe for target 'check-recursive' failed
make[1]: *** [check-recursive] Error 1
make[1]: Leaving directory '/home/ubuntu/src/src'
Makefile:782: recipe for target 'check-recursive' failed
make: *** [check-recursive] Error 1

real    0m0.231s
user    0m0.193s
sys     0m0.104s
Build finished with exit code 2
#BUILD#e535036d-c809-47ca-a6ed-270a61de3374#: 2