« part of build 15487  

Details for job d4870568-2e92-4553-b878-a51d1848b799


Name Linux x86_64
Success failed
Build Time 00:01:13
Git Head 600efe49b82a734d218b366d42dabcd7f7d989dd
PR 23432
Worker # 4
Base Image ubuntu1804_full_base

Pull request info

Pull# 23432

Tasks time consumption

00:00:17 - GIT_CHECKOUT
00:00:10 - APT_INSTALL
00:00:00 - RESTORE_CACHE
00:00:02 - MAKE_DEPENDS
00:00:15 - CONFIGURE

Build log tail

        module extrakeys        = yes
  module schnorrsig       = yes
  module ellsq            = yes

  asm                     = x86_64
  ecmult window size      = 15
  ecmult gen prec. bits   = 4

  valgrind                = no
  CC                      = gcc -m64
  CPPFLAGS                =  -I/home/ubuntu/src/depends/x86_64-unknown-linux-gnu/include/ 
  SECP_CFLAGS             = -O2  -std=c89 -pedantic -Wno-long-long -Wnested-externs -Wshadow -Wstrict-prototypes -Wundef -Wno-overlength-strings -Wall -Wno-unused-function -Wextra -Wcast-align -fvisibility=hidden 
  CFLAGS                  = -pipe -O2 
  LDFLAGS                 = -L/home/ubuntu/src/depends/x86_64-unknown-linux-gnu/lib 

  CC_FOR_BUILD            = gcc -m64
  CPPFLAGS_FOR_BUILD      =  -I/home/ubuntu/src/depends/x86_64-unknown-linux-gnu/include/ 
  SECP_CFLAGS_FOR_BUILD   = -O2  -std=c89 -pedantic -Wno-long-long -Wnested-externs -Wshadow -Wstrict-prototypes -Wundef -Wno-overlength-strings -Wall -Wno-unused-function -Wextra -Wcast-align -fvisibility=hidden 
  CFLAGS_FOR_BUILD        = -pipe -O2 
  LDFLAGS_FOR_BUILD       = -L/home/ubuntu/src/depends/x86_64-unknown-linux-gnu/lib 

Options used to compile and link:
  external signer = yes
  multiprocess    = no
  with experimental syscall sandbox support = yes
  with libs       = yes
  with wallet     = yes
    with sqlite   = yes
    with bdb      = yes
  with gui / qt   = yes
    with qr       = yes
  with zmq        = yes
  with test       = yes
  with bench      = yes
  with upnp       = yes
  with natpmp     = yes
  use asm         = yes
  ebpf tracing    = no
  sanitizers      = 
  debug enabled   = no
  gprof enabled   = no
  werror          = no

  target os       = linux
  build os        = linux-gnu

  CC              = /usr/bin/ccache gcc -m64
  CFLAGS          = -pthread -pipe -O2 
  CPPFLAGS        =   -U_FORTIFY_SOURCE -D_FORTIFY_SOURCE=2 -I/home/ubuntu/src/depends/x86_64-unknown-linux-gnu/include/  -DHAVE_BUILD_INFO -D__STDC_FORMAT_MACROS -DPROVIDE_FUZZ_MAIN_FUNCTION
  CXX             = /usr/bin/ccache g++ -m64 -std=c++17
  CXXFLAGS        =  -fdebug-prefix-map=$(abs_top_srcdir)=.  -fstack-reuse=none -Wstack-protector -fstack-protector-all     -pipe -O2  -fno-extended-identifiers -fvisibility=hidden
  LDFLAGS         = -lpthread  -Wl,-z,relro -Wl,-z,now -Wl,-z,separate-code -pie  -L/home/ubuntu/src/depends/x86_64-unknown-linux-gnu/lib 
  ARFLAGS         = cr

real    0m14.692s
user    0m12.926s
sys     0m2.694s
+ timeblock_end CONFIGURE
++ date +%s
+ echo -e '\n###END#CONFIGURE#1637861323\n\n\n'


+ timeblock_start COMPILE_AND_INSTALL
++ date +%s
+ echo -e '\n###START#COMPILE_AND_INSTALL#1637861323\n'


+ make install -j4
Making install in src
make[1]: Entering directory '/home/ubuntu/src/src'
make[2]: Entering directory '/home/ubuntu/src/src'
  CXX      libbitcoinconsensus_la-arith_uint256.lo
  CXX      libbitcoinconsensus_la-hash.lo
  CXX      libbitcoinconsensus_la-pubkey.lo
  CXX      libbitcoinconsensus_la-uint256.lo
In file included from uint256.cpp:8:0:
./util/strencodings.h:16:10: fatal error: charconv: No such file or directory
 #include <charconv>
compilation terminated.
Makefile:11990: recipe for target 'libbitcoinconsensus_la-uint256.lo' failed
make[2]: *** [libbitcoinconsensus_la-uint256.lo] Error 1
make[2]: *** Waiting for unfinished jobs....
make[2]: Leaving directory '/home/ubuntu/src/src'
Makefile:15884: recipe for target 'install-recursive' failed
make[1]: *** [install-recursive] Error 1
make[1]: Leaving directory '/home/ubuntu/src/src'
Makefile:813: recipe for target 'install-recursive' failed
make: *** [install-recursive] Error 1

real    0m0.859s
user    0m1.649s
sys     0m0.241s
Build finished with exit code 2
#BUILD#d4870568-2e92-4553-b878-a51d1848b799#: 2