« part of build 2777  

Details for job d27de569-283d-4ada-815d-70fff715cb4e

failed

Name macOS
Success failed
Build Time 00:02:28
Git Head 7055c6d7ba57bea4e579eef0a7827ee80a64ad62
PR 19753
Worker # 3
Base Image ubuntu1804_full_base

Pull request info

Pull# 19753
Title
Head
Mergable
Changes
Comments
User

Tasks time consumption

00:00:21 - GIT_CHECKOUT
00:00:44 - APT_INSTALL
00:00:00 - RESTORE_CACHE
00:00:06 - MAKE_DEPENDS
00:00:06 - UPDATE_DEPENDENCY_CACHE
00:00:19 - CONFIGURE

Build log tail

        GEN      qt/moc_overviewpage.cpp
  GEN      qt/moc_peertablemodel.cpp
  GEN      qt/moc_psbtoperationsdialog.cpp
  GEN      qt/moc_paymentserver.cpp
  GEN      qt/moc_qrimagewidget.cpp
  GEN      qt/moc_qvalidatedlineedit.cpp
  GEN      qt/moc_qvaluecombobox.cpp
  GEN      qt/moc_receivecoinsdialog.cpp
  GEN      qt/moc_receiverequestdialog.cpp
  GEN      qt/moc_recentrequeststablemodel.cpp
  GEN      qt/moc_rpcconsole.cpp
  GEN      qt/moc_sendcoinsdialog.cpp
  GEN      qt/moc_sendcoinsentry.cpp
  GEN      qt/moc_signverifymessagedialog.cpp
  GEN      qt/moc_splashscreen.cpp
  GEN      qt/moc_trafficgraphwidget.cpp
  GEN      qt/moc_transactiondesc.cpp
  GEN      qt/moc_transactiondescdialog.cpp
  GEN      qt/moc_transactionfilterproxy.cpp
  GEN      qt/moc_transactionview.cpp
  GEN      qt/moc_transactiontablemodel.cpp
  GEN      qt/moc_utilitydialog.cpp
  GEN      qt/moc_walletcontroller.cpp
  GEN      qt/moc_walletframe.cpp
  GEN      qt/moc_walletmodel.cpp
  GEN      qt/moc_walletview.cpp
  GEN      qt/qrc_bitcoin.cpp
  GEN      qt/locale/bitcoin_af.qm
net_processing.cpp:3000:74: error: expected ')'
        if (AlreadyHaveTx(GenTxid(/* is_wtxid=*/true, wtxid), m_mempool) {
                                                                         ^
net_processing.cpp:3000:12: note: to match this '('
        if (AlreadyHaveTx(GenTxid(/* is_wtxid=*/true, wtxid), m_mempool) {
           ^
net_processing.cpp:3018:43: error: use of undeclared identifier 'state'
        if (AcceptToMemoryPool(m_mempool, state, ptx, &lRemovedTxn, false /* bypass_limits */, 0 /* nAbsurdFee */)) {
                                          ^
net_processing.cpp:3040:18: error: use of undeclared identifier 'state'; did you mean 'State'?
        else if (state.GetResult() == TxValidationResult::TX_MISSING_INPUTS)
                 ^~~~~
                 State
net_processing.cpp:463:20: note: 'State' declared here
static CNodeState *State(NodeId pnode) EXCLUSIVE_LOCKS_REQUIRED(cs_main) {
                   ^
net_processing.cpp:3040:23: error: member reference base type '(anonymous namespace)::CNodeState *(NodeId)' (aka '(anonymous namespace)::CNodeState *(long long)') is not a structure or union
        else if (state.GetResult() == TxValidationResult::TX_MISSING_INPUTS)
                 ~~~~~^~~~~~~~~~
net_processing.cpp:3093:17: error: use of undeclared identifier 'state'; did you mean 'State'?
            if (state.GetResult() != TxValidationResult::TX_WITNESS_STRIPPED) {
                ^~~~~
                State
net_processing.cpp:463:20: note: 'State' declared here
static CNodeState *State(NodeId pnode) EXCLUSIVE_LOCKS_REQUIRED(cs_main) {
                   ^
net_processing.cpp:3093:22: error: member reference base type '(anonymous namespace)::CNodeState *(NodeId)' (aka '(anonymous namespace)::CNodeState *(long long)') is not a structure or union
            if (state.GetResult() != TxValidationResult::TX_WITNESS_STRIPPED) {
                ~~~~~^~~~~~~~~~
net_processing.cpp:3117:21: error: use of undeclared identifier 'state'; did you mean 'State'?
                if (state.GetResult() == TxValidationResult::TX_INPUTS_NOT_STANDARD && tx.GetWitnessHash() != tx.GetHash()) {
                    ^~~~~
                    State
net_processing.cpp:463:20: note: 'State' declared here
static CNodeState *State(NodeId pnode) EXCLUSIVE_LOCKS_REQUIRED(cs_main) {
                   ^
net_processing.cpp:3117:26: error: member reference base type '(anonymous namespace)::CNodeState *(NodeId)' (aka '(anonymous namespace)::CNodeState *(long long)') is not a structure or union
                if (state.GetResult() == TxValidationResult::TX_INPUTS_NOT_STANDARD && tx.GetWitnessHash() != tx.GetHash()) {
                    ~~~~~^~~~~~~~~~
net_processing.cpp:3146:13: error: use of undeclared identifier 'state'; did you mean 'State'?
        if (state.IsInvalid()) {
            ^~~~~
            State
net_processing.cpp:463:20: note: 'State' declared here
static CNodeState *State(NodeId pnode) EXCLUSIVE_LOCKS_REQUIRED(cs_main) {
                   ^
net_processing.cpp:3146:18: error: member reference base type '(anonymous namespace)::CNodeState *(NodeId)' (aka '(anonymous namespace)::CNodeState *(long long)') is not a structure or union
        if (state.IsInvalid()) {
            ~~~~~^~~~~~~~~~
net_processing.cpp:3149:17: error: use of undeclared identifier 'state'
                state.ToString());
                ^
net_processing.cpp:3150:49: error: use of undeclared identifier 'state'
            MaybePunishNodeForTx(pfrom.GetId(), state);
                                                ^
12 errors generated.
  GEN      qt/locale/bitcoin_am.qm
Makefile:11121: recipe for target 'libbitcoin_server_a-net_processing.o' failed
make[2]: *** [libbitcoin_server_a-net_processing.o] Error 1
make[2]: *** Waiting for unfinished jobs....
make[2]: Leaving directory '/home/ubuntu/src/src'
Makefile:18343: recipe for target 'all-recursive' failed
make[1]: *** [all-recursive] Error 1
make[1]: Leaving directory '/home/ubuntu/src/src'
Makefile:798: recipe for target 'all-recursive' failed
make: *** [all-recursive] Error 1

real    0m4.870s
user    0m12.835s
sys     0m1.538s
Build finished with exit code 2
#BUILD#d27de569-283d-4ada-815d-70fff715cb4e#: 2