« part of build 5038  

Details for job cb17fe51-b08e-43e2-860e-b8eb9be8000b

failed

Name macOS
Success failed
Build Time 00:12:58
Git Head e65df535b7e49768d94e04ae728961a446eb5f21
PR 17792
Worker # 5
Base Image ubuntu1804_full_base

Pull request info

Pull# 17792
Title
Head
Mergable
Changes
Comments
User

Tasks time consumption

00:00:16 - GIT_CHECKOUT
00:12:04 - APT_INSTALL
00:00:01 - RESTORE_CACHE

Build log tail

      tar: Ignoring unknown extended header keyword 'SCHILY.dev'
tar: Ignoring unknown extended header keyword 'SCHILY.ino'
tar: Ignoring unknown extended header keyword 'SCHILY.nlink'
tar: Ignoring unknown extended header keyword 'SCHILY.dev'
tar: Ignoring unknown extended header keyword 'SCHILY.ino'
tar: Ignoring unknown extended header keyword 'SCHILY.nlink'
tar: Ignoring unknown extended header keyword 'SCHILY.dev'
tar: Ignoring unknown extended header keyword 'SCHILY.ino'
tar: Ignoring unknown extended header keyword 'SCHILY.nlink'
tar: Ignoring unknown extended header keyword 'SCHILY.dev'
tar: Ignoring unknown extended header keyword 'SCHILY.ino'
tar: Ignoring unknown extended header keyword 'SCHILY.nlink'
tar: Ignoring unknown extended header keyword 'SCHILY.dev'
tar: Ignoring unknown extended header keyword 'SCHILY.ino'
tar: Ignoring unknown extended header keyword 'SCHILY.nlink'
tar: Ignoring unknown extended header keyword 'SCHILY.dev'
tar: Ignoring unknown extended header keyword 'SCHILY.ino'
tar: Ignoring unknown extended header keyword 'SCHILY.nlink'
tar: Ignoring unknown extended header keyword 'SCHILY.dev'
tar: Ignoring unknown extended header keyword 'SCHILY.ino'
tar: Ignoring unknown extended header keyword 'SCHILY.nlink'
tar: Ignoring unknown extended header keyword 'SCHILY.dev'
tar: Ignoring unknown extended header keyword 'SCHILY.ino'
tar: Ignoring unknown extended header keyword 'SCHILY.nlink'
tar: Ignoring unknown extended header keyword 'SCHILY.dev'
tar: Ignoring unknown extended header keyword 'SCHILY.ino'
tar: Ignoring unknown extended header keyword 'SCHILY.nlink'
tar: Ignoring unknown extended header keyword 'SCHILY.dev'
tar: Ignoring unknown extended header keyword 'SCHILY.ino'
tar: Ignoring unknown extended header keyword 'SCHILY.nlink'
tar: Ignoring unknown extended header keyword 'SCHILY.dev'
tar: Ignoring unknown extended header keyword 'SCHILY.ino'
tar: Ignoring unknown extended header keyword 'SCHILY.nlink'
tar: Ignoring unknown extended header keyword 'SCHILY.dev'
tar: Ignoring unknown extended header keyword 'SCHILY.ino'
tar: Ignoring unknown extended header keyword 'SCHILY.nlink'
tar: Ignoring unknown extended header keyword 'SCHILY.dev'
tar: Ignoring unknown extended header keyword 'SCHILY.ino'
tar: Ignoring unknown extended header keyword 'SCHILY.nlink'
tar: Ignoring unknown extended header keyword 'SCHILY.dev'
tar: Ignoring unknown extended header keyword 'SCHILY.ino'
tar: Ignoring unknown extended header keyword 'SCHILY.nlink'
tar: Ignoring unknown extended header keyword 'SCHILY.dev'
tar: Ignoring unknown extended header keyword 'SCHILY.ino'
tar: Ignoring unknown extended header keyword 'SCHILY.nlink'
tar: Ignoring unknown extended header keyword 'SCHILY.dev'
tar: Ignoring unknown extended header keyword 'SCHILY.ino'
tar: Ignoring unknown extended header keyword 'SCHILY.nlink'
tar: Ignoring unknown extended header keyword 'SCHILY.dev'
tar: Ignoring unknown extended header keyword 'SCHILY.ino'
tar: Ignoring unknown extended header keyword 'SCHILY.nlink'
tar: Ignoring unknown extended header keyword 'SCHILY.dev'
tar: Ignoring unknown extended header keyword 'SCHILY.ino'
tar: Ignoring unknown extended header keyword 'SCHILY.nlink'
tar: Ignoring unknown extended header keyword 'SCHILY.dev'
tar: Ignoring unknown extended header keyword 'SCHILY.ino'
tar: Ignoring unknown extended header keyword 'SCHILY.nlink'
tar: Ignoring unknown extended header keyword 'SCHILY.dev'
tar: Ignoring unknown extended header keyword 'SCHILY.ino'
tar: Ignoring unknown extended header keyword 'SCHILY.nlink'
tar: Ignoring unknown extended header keyword 'SCHILY.dev'
tar: Ignoring unknown extended header keyword 'SCHILY.ino'
tar: Ignoring unknown extended header keyword 'SCHILY.nlink'
tar: Ignoring unknown extended header keyword 'SCHILY.dev'
tar: Ignoring unknown extended header keyword 'SCHILY.ino'
tar: Ignoring unknown extended header keyword 'SCHILY.nlink'
+ timeblock_start MAKE_DEPENDS
++ date +%s
+ echo -e '\n###START#MAKE_DEPENDS#1578998924\n'

###START#MAKE_DEPENDS#1578998924

+ cd depends
+ make HOST=x86_64-apple-darwin14 -j4
Fetching biplist-1.0.3.tar.gz from https://bitbucket.org/wooster/biplist/downloads
  % Total    % Received % Xferd  Average Speed   Time    Time     Time  Current
                                 Dload  Upload   Total   Spent    Left  Speed

  0     0    0     0    0     0      0      0 --:--:-- --:--:-- --:--:--     0
  0     0    0     0    0     0      0      0 --:--:-- --:--:-- --:--:--     0
  0     0    0     0    0     0      0      0 --:--:-- --:--:-- --:--:--     0

100 21258  100 21258    0     0  17969      0  0:00:01  0:00:01 --:--:-- 17969
/home/ubuntu/src/depends/work/download/native_biplist-1.0.3/biplist-1.0.3.tar.gz.temp: OK
Extracting native_biplist...
/home/ubuntu/src/depends/sources/biplist-1.0.3.tar.gz: OK
Preprocessing native_biplist...
Configuring native_biplist...
Building native_biplist...
Traceback (most recent call last):
  File "setup.py", line 4, in <module>
    from setuptools import setup, find_packages
ModuleNotFoundError: No module named 'setuptools'

During handling of the above exception, another exception occurred:

Traceback (most recent call last):
  File "setup.py", line 6, in <module>
    import ez_setup
ModuleNotFoundError: No module named 'ez_setup'
funcs.mk:251: recipe for target '/home/ubuntu/src/depends/work/build/x86_64-apple-darwin14/native_biplist/1.0.3-2142bdbedcb/./.stamp_built' failed
make: *** [/home/ubuntu/src/depends/work/build/x86_64-apple-darwin14/native_biplist/1.0.3-2142bdbedcb/./.stamp_built] Error 1
Build finished with exit code 2
#BUILD#cb17fe51-b08e-43e2-860e-b8eb9be8000b#: 2