« part of build 15487  

Details for job ca2dce3c-1c2e-4d43-b625-afb7bfdbc150


Name Win64
Success failed
Build Time 00:01:19
Git Head 600efe49b82a734d218b366d42dabcd7f7d989dd
PR 23432
Worker # 2
Base Image ubuntu1804_full_base

Pull request info

Pull# 23432

Tasks time consumption

00:00:16 - GIT_CHECKOUT
00:00:10 - APT_INSTALL
00:00:00 - RESTORE_CACHE
00:00:02 - MAKE_DEPENDS
00:00:22 - CONFIGURE

Build log tail

        module extrakeys        = yes
  module schnorrsig       = yes
  module ellsq            = yes

  asm                     = x86_64
  ecmult window size      = 15
  ecmult gen prec. bits   = 4

  valgrind                = no
  CC                      = x86_64-w64-mingw32-gcc
  CPPFLAGS                =  -I/home/ubuntu/src/depends/x86_64-w64-mingw32/include/ 
  SECP_CFLAGS             = -O2  -std=c89 -pedantic -Wno-long-long -Wnested-externs -Wshadow -Wstrict-prototypes -Wundef -Wno-overlength-strings -Wall -Wno-unused-function -Wextra -Wcast-align -fvisibility=hidden 
  CFLAGS                  = -pipe -O2 
  LDFLAGS                 = -L/home/ubuntu/src/depends/x86_64-w64-mingw32/lib 

  CC_FOR_BUILD            = x86_64-w64-mingw32-gcc
  CPPFLAGS_FOR_BUILD      =  -I/home/ubuntu/src/depends/x86_64-w64-mingw32/include/ 
  SECP_CFLAGS_FOR_BUILD   = -O2  -std=c89 -pedantic -Wno-long-long -Wnested-externs -Wshadow -Wstrict-prototypes -Wundef -Wno-overlength-strings -Wall -Wno-unused-function -Wextra -Wcast-align -fvisibility=hidden 
  CFLAGS_FOR_BUILD        = -pipe -O2 
  LDFLAGS_FOR_BUILD       = -L/home/ubuntu/src/depends/x86_64-w64-mingw32/lib 

Options used to compile and link:
  external signer = no
  multiprocess    = no
  with experimental syscall sandbox support = no
  with libs       = yes
  with wallet     = yes
    with sqlite   = yes
    with bdb      = yes
  with gui / qt   = yes
    with qr       = yes
  with zmq        = yes
  with test       = yes
  with bench      = yes
  with upnp       = yes
  with natpmp     = yes
  use asm         = yes
  ebpf tracing    = no
  sanitizers      = 
  debug enabled   = no
  gprof enabled   = no
  werror          = no

  target os       = windows
  build os        = linux-gnu

  CC              = /usr/bin/ccache x86_64-w64-mingw32-gcc
  CFLAGS          = -pthread -pipe -O2 
  CXX             = /usr/bin/ccache x86_64-w64-mingw32-g++ -std=c++17
  CXXFLAGS        =  -fdebug-prefix-map=$(abs_top_srcdir)=.  -fstack-reuse=none -Wstack-protector -fstack-protector-all     -pipe -O2  -fno-extended-identifiers -fvisibility=hidden
  LDFLAGS         = -lpthread  -Wl,--dynamicbase -Wl,--nxcompat -Wl,--high-entropy-va -pie  -L/home/ubuntu/src/depends/x86_64-w64-mingw32/lib  -Wl,--major-subsystem-version -Wl,6 -Wl,--minor-subsystem-version -Wl,1
  ARFLAGS         = cr

real    0m22.003s
user    0m16.115s
sys     0m3.604s
+ timeblock_end CONFIGURE
++ date +%s
+ echo -e '\n###END#CONFIGURE#1637861327\n\n\n'


+ timeblock_start COMPILE_AND_INSTALL
++ date +%s
+ echo -e '\n###START#COMPILE_AND_INSTALL#1637861327\n'


+ make deploy -j4
Making all in src
make[1]: Entering directory '/home/ubuntu/src/src'
make[2]: Entering directory '/home/ubuntu/src/src'
  CXX      libbitcoinconsensus_la-arith_uint256.lo
  CXX      libbitcoinconsensus_la-hash.lo
  CXX      libbitcoinconsensus_la-pubkey.lo
  CXX      libbitcoinconsensus_la-uint256.lo
In file included from uint256.cpp:8:0:
./util/strencodings.h:16:10: fatal error: charconv: No such file or directory
 #include <charconv>
compilation terminated.
Makefile:11990: recipe for target 'libbitcoinconsensus_la-uint256.lo' failed
make[2]: *** [libbitcoinconsensus_la-uint256.lo] Error 1
make[2]: *** Waiting for unfinished jobs....
make[2]: Leaving directory '/home/ubuntu/src/src'
Makefile:15884: recipe for target 'all-recursive' failed
make[1]: *** [all-recursive] Error 1
make[1]: Leaving directory '/home/ubuntu/src/src'
Makefile:813: recipe for target 'all-recursive' failed
make: *** [all-recursive] Error 1

real    0m1.415s
user    0m2.874s
sys     0m0.363s
Build finished with exit code 2
#BUILD#ca2dce3c-1c2e-4d43-b625-afb7bfdbc150#: 2