« part of build 5045  

Details for job c9405ee1-6c54-441a-96ba-87b91dd13b18

failed

Name Linux x86_64 - system libs, clang
Success failed
Build Time 00:16:13
Git Head 8efa0f3d3cf5628e70fef35cf3c0581cc15de5f6
PR 17918
Worker # 3
Base Image ubuntu1804_full_base

Pull request info

Pull# 17918
Title
Head
Mergable
Changes
Comments
User

Tasks time consumption

00:00:13 - GIT_CHECKOUT
00:12:04 - APT_INSTALL
00:00:01 - RESTORE_CACHE
00:00:16 - CONFIGURE
00:03:09 - COMPILE_AND_INSTALL
00:00:01 - UPDATE_CCACHE_CACHE

Build log tail

      
real    0m0.505s
user    0m0.000s
sys     0m0.134s
+ '[' -f /mnt/shared/cache/1b374ee2f07eee86aa472ac8afb69fde_ccache_x86_64-unknown-linux-gnu-syslibs.tar ']'
+ mv /mnt/shared/cache/1b374ee2f07eee86aa472ac8afb69fde_ccache_copy_x86_64-unknown-linux-gnu-syslibs.tar /mnt/shared/cache/1b374ee2f07eee86aa472ac8afb69fde_ccache_x86_64-unknown-linux-gnu-syslibs.tar

real    0m0.006s
user    0m0.001s
sys     0m0.000s
+ timeblock_end UPDATE_CCACHE_CACHE
++ date +%s
+ echo -e '\n###END#UPDATE_CCACHE_CACHE#1579024381\n\n\n'

###END#UPDATE_CCACHE_CACHE#1579024381



+ '[' true = true ']'
+ timeblock_start RUN_UNIT_TESTS
++ date +%s
+ echo -e '\n###START#RUN_UNIT_TESTS#1579024381\n'

###START#RUN_UNIT_TESTS#1579024381

+ make -j4 check VERBOSE=1
Making check in src
make[1]: Entering directory '/home/ubuntu/src/src'
make[2]: Entering directory '/home/ubuntu/src/src'
make  check-TESTS check-local
make[3]: Entering directory '/home/ubuntu/src/src'
Running tests: arith_uint256_tests from test/arith_uint256_tests.cpp
Running tests: amount_tests from test/amount_tests.cpp
Running tests: addrman_tests from test/addrman_tests.cpp
make[4]: Entering directory '/home/ubuntu/src/src'
AddressSanitizer: failed to parse suppressions
Makefile:15790: recipe for target 'test/addrman_tests.cpp.test' failed
make[3]: *** [test/addrman_tests.cpp.test] Error 1
make[3]: *** Waiting for unfinished jobs....
AddressSanitizer: failed to parse suppressions
Makefile:15790: recipe for target 'test/arith_uint256_tests.cpp.test' failed
make[3]: *** [test/arith_uint256_tests.cpp.test] Error 1
AddressSanitizer: failed to parse suppressions
Makefile:15790: recipe for target 'test/amount_tests.cpp.test' failed
make[3]: *** [test/amount_tests.cpp.test] Error 1
FAIL: qt/test/test_bitcoin-qt
==============================================
   Bitcoin Core 0.19.99: src/test-suite.log
==============================================

# TOTAL: 1
# PASS:  0
# SKIP:  0
# XFAIL: 0
# FAIL:  1
# XPASS: 0
# ERROR: 0

.. contents:: :depth: 2

FAIL: qt/test/test_bitcoin-qt
=============================

AddressSanitizer: failed to parse suppressions
FAIL qt/test/test_bitcoin-qt (exit status: 1)

============================================================================
Testsuite summary for Bitcoin Core 0.19.99
============================================================================
# TOTAL: 1
# PASS:  0
# SKIP:  0
# XFAIL: 0
# FAIL:  1
# XPASS: 0
# ERROR: 0
============================================================================
See src/test-suite.log
Please report to https://github.com/bitcoin/bitcoin/issues
============================================================================
Makefile:15325: recipe for target 'test-suite.log' failed
make[4]: *** [test-suite.log] Error 1
make[4]: Leaving directory '/home/ubuntu/src/src'
Makefile:15431: recipe for target 'check-TESTS' failed
make[3]: *** [check-TESTS] Error 2
make[3]: Leaving directory '/home/ubuntu/src/src'
Makefile:15530: recipe for target 'check-am' failed
make[2]: *** [check-am] Error 2
make[2]: Leaving directory '/home/ubuntu/src/src'
Makefile:15218: recipe for target 'check-recursive' failed
make[1]: *** [check-recursive] Error 1
make[1]: Leaving directory '/home/ubuntu/src/src'
Makefile:782: recipe for target 'check-recursive' failed
make: *** [check-recursive] Error 1

real    0m0.229s
user    0m0.196s
sys     0m0.115s
Build finished with exit code 2
#BUILD#c9405ee1-6c54-441a-96ba-87b91dd13b18#: 2