« part of build 2777  

Details for job c661da96-a9c1-4372-98e1-55a9603a690b

failed

Name Win64
Success failed
Build Time 00:01:59
Git Head 7055c6d7ba57bea4e579eef0a7827ee80a64ad62
PR 19753
Worker # 4
Base Image ubuntu1804_full_base

Pull request info

Pull# 19753
Title
Head
Mergable
Changes
Comments
User

Tasks time consumption

00:00:22 - GIT_CHECKOUT
00:00:11 - APT_INSTALL
00:00:00 - RESTORE_CACHE
00:00:03 - MAKE_DEPENDS
00:00:05 - UPDATE_DEPENDENCY_CACHE
00:00:28 - CONFIGURE

Build log tail

      If this sounds wrong, possibly the target language is not set or recognized.
  GEN      qt/locale/bitcoin_pt_BR.qm
  GEN      qt/locale/bitcoin_ru.qm
  GEN      qt/locale/bitcoin_ro.qm
Removed plural forms as the target language has less forms.
If this sounds wrong, possibly the target language is not set or recognized.
  GEN      qt/locale/bitcoin_si.qm
  GEN      qt/locale/bitcoin_sk.qm
  GEN      qt/locale/bitcoin_sl.qm
Removed plural forms as the target language has less forms.
If this sounds wrong, possibly the target language is not set or recognized.
  GEN      qt/locale/bitcoin_sn.qm
  GEN      qt/locale/bitcoin_sr.qm
  GEN      qt/locale/bitcoin_sq.qm
  GEN      qt/locale/bitcoin_sr@latin.qm
  GEN      qt/locale/bitcoin_sv.qm
  GEN      qt/locale/bitcoin_szl.qm
Removed plural forms as the target language has less forms.
If this sounds wrong, possibly the target language is not set or recognized.
  GEN      qt/locale/bitcoin_te.qm
  GEN      qt/locale/bitcoin_th.qm
  GEN      qt/locale/bitcoin_ta.qm
  GEN      qt/locale/bitcoin_tr.qm
  GEN      qt/locale/bitcoin_uk.qm
Removed plural forms as the target language has less forms.
If this sounds wrong, possibly the target language is not set or recognized.
  GEN      qt/locale/bitcoin_ur.qm
Removed plural forms as the target language has less forms.
If this sounds wrong, possibly the target language is not set or recognized.
  GEN      qt/locale/bitcoin_uz@Latn.qm
  GEN      qt/locale/bitcoin_uz@Cyrl.qm
  GEN      qt/locale/bitcoin_yo.qm
  GEN      qt/locale/bitcoin_vi.qm
  GEN      qt/locale/bitcoin_zh-Hans.qm
  GEN      qt/locale/bitcoin_zh.qm
  GEN      qt/locale/bitcoin_zh_CN.qm
  GEN      qt/locale/bitcoin_zh_HK.qm
  CXX      support/libbitcoinconsensus_la-cleanse.lo
  GEN      qt/locale/bitcoin_zh_TW.qm
  CXX      crypto/libbitcoinconsensus_la-chacha_poly_aead.lo
  CXX      crypto/libbitcoinconsensus_la-aes.lo
  CXX      crypto/libbitcoinconsensus_la-chacha20.lo
  CXX      crypto/libbitcoinconsensus_la-hkdf_sha256_32.lo
  CXX      crypto/libbitcoinconsensus_la-hmac_sha256.lo
  CXX      crypto/libbitcoinconsensus_la-hmac_sha512.lo
  CXX      crypto/libbitcoinconsensus_la-poly1305.lo
  CXX      crypto/libbitcoinconsensus_la-ripemd160.lo
  CXX      crypto/libbitcoinconsensus_la-sha1.lo
  CXX      crypto/libbitcoinconsensus_la-sha256.lo
  CXX      crypto/libbitcoinconsensus_la-sha3.lo
  CXX      crypto/libbitcoinconsensus_la-sha512.lo
  CXX      crypto/libbitcoinconsensus_la-siphash.lo
  CXX      crypto/libbitcoinconsensus_la-sha256_sse4.lo
  CXX      consensus/libbitcoinconsensus_la-merkle.lo
  CXX      consensus/libbitcoinconsensus_la-tx_check.lo
  CXX      primitives/libbitcoinconsensus_la-block.lo
  CXX      primitives/libbitcoinconsensus_la-transaction.lo
  CXX      script/libbitcoinconsensus_la-bitcoinconsensus.lo
  CXX      script/libbitcoinconsensus_la-interpreter.lo
  CXX      script/libbitcoinconsensus_la-script.lo
net_processing.cpp: In member function ‘void PeerManager::ProcessMessage(CNode&, const string&, CDataStream&, std::chrono::microseconds, const std::atomic<bool>&)’:
net_processing.cpp:3000:13: warning: init-statement in selection statements only available with -std=c++1z or -std=gnu++1z
         if (AlreadyHaveTx(GenTxid(/* is_wtxid=*/true, wtxid), m_mempool) {
             ^~~~~~~~~~~~~
net_processing.cpp:3000:74: error: expected ‘;’ before ‘{’ token
         if (AlreadyHaveTx(GenTxid(/* is_wtxid=*/true, wtxid), m_mempool) {
                                                                          ^
net_processing.cpp:3015:27: error: expected primary-expression before ‘state’
         TxValidationState state;
                           ^~~~~
net_processing.cpp:3015:27: error: expected ‘)’ before ‘state’
net_processing.cpp:3018:43: error: ‘state’ was not declared in this scope
         if (AcceptToMemoryPool(m_mempool, state, ptx, &lRemovedTxn, false /* bypass_limits */, 0 /* nAbsurdFee */)) {
                                           ^~~~~
net_processing.cpp:3018:43: note: suggested alternative: ‘stat’
         if (AcceptToMemoryPool(m_mempool, state, ptx, &lRemovedTxn, false /* bypass_limits */, 0 /* nAbsurdFee */)) {
                                           ^~~~~
                                           stat
net_processing.cpp:3146:13: error: ‘state’ was not declared in this scope
         if (state.IsInvalid()) {
             ^~~~~
net_processing.cpp:3146:13: note: suggested alternative: ‘stat’
         if (state.IsInvalid()) {
             ^~~~~
             stat
Makefile:11121: recipe for target 'libbitcoin_server_a-net_processing.o' failed
make[2]: *** [libbitcoin_server_a-net_processing.o] Error 1
make[2]: *** Waiting for unfinished jobs....
make[2]: Leaving directory '/home/ubuntu/src/src'
Makefile:18343: recipe for target 'all-recursive' failed
make[1]: *** [all-recursive] Error 1
make[1]: Leaving directory '/home/ubuntu/src/src'
Makefile:798: recipe for target 'all-recursive' failed
make: *** [all-recursive] Error 1

real    0m5.175s
user    0m13.235s
sys     0m1.637s
Build finished with exit code 2
#BUILD#c661da96-a9c1-4372-98e1-55a9603a690b#: 2