« part of build 14346  

Details for job c182867e-d6e5-48be-a14d-6c03fa3d18cd

failed

Name Win64
Success failed
Build Time 00:01:21
Git Head c2375de502c19f873469abe3884ba678b341d6d2
PR 15294
Worker # 2
Base Image ubuntu1804_full_base

Pull request info

Pull# 15294
Title
Head
Mergable
Changes
Comments
User

Tasks time consumption

00:00:12 - GIT_CHECKOUT
00:00:09 - APT_INSTALL
00:00:00 - RESTORE_CACHE
00:00:02 - MAKE_DEPENDS
00:00:00 - UPDATE_DEPENDENCY_CACHE
00:00:23 - CONFIGURE

Build log tail

        module recovery         = yes
  module extrakeys        = yes
  module schnorrsig       = yes

  asm                     = x86_64
  ecmult window size      = 15
  ecmult gen prec. bits   = 4

  valgrind                = no
  CC                      = x86_64-w64-mingw32-gcc
  CPPFLAGS                =  -I/home/ubuntu/src/depends/x86_64-w64-mingw32/include/ 
  SECP_CFLAGS             = -O2  -std=c89 -pedantic -Wno-long-long -Wnested-externs -Wshadow -Wstrict-prototypes -Wundef -Wno-overlength-strings -Wall -Wno-unused-function -Wextra -Wcast-align -fvisibility=hidden 
  CFLAGS                  = -pipe -O2 
  LDFLAGS                 = -L/home/ubuntu/src/depends/x86_64-w64-mingw32/lib 

  CC_FOR_BUILD            = x86_64-w64-mingw32-gcc
  CPPFLAGS_FOR_BUILD      =  -I/home/ubuntu/src/depends/x86_64-w64-mingw32/include/ 
  SECP_CFLAGS_FOR_BUILD   = -O2  -std=c89 -pedantic -Wno-long-long -Wnested-externs -Wshadow -Wstrict-prototypes -Wundef -Wno-overlength-strings -Wall -Wno-unused-function -Wextra -Wcast-align -fvisibility=hidden 
  CFLAGS_FOR_BUILD        = -pipe -O2 
  LDFLAGS_FOR_BUILD       = -L/home/ubuntu/src/depends/x86_64-w64-mingw32/lib 

Options used to compile and link:
  external signer = no
  multiprocess    = no
  with experimental syscall sandbox support = no
  with libs       = yes
  with wallet     = yes
    with sqlite   = yes
    with bdb      = yes
  with gui / qt   = yes
    with qr       = yes
  with zmq        = yes
  with test       = yes
  with bench      = yes
  with upnp       = yes
  with natpmp     = yes
  use asm         = yes
  ebpf tracing    = no
  sanitizers      = 
  debug enabled   = no
  gprof enabled   = no
  werror          = no

  target os       = windows
  build os        = linux-gnu

  CC              = /usr/bin/ccache x86_64-w64-mingw32-gcc
  CFLAGS          = -pthread -pipe -O2 
  CPPFLAGS        =   -U_FORTIFY_SOURCE -D_FORTIFY_SOURCE=2 -I/home/ubuntu/src/depends/x86_64-w64-mingw32/include/  -DHAVE_BUILD_INFO -D__STDC_FORMAT_MACROS -D_MT -DWIN32 -D_WINDOWS -D_WIN32_WINNT=0x0601 -D_WIN32_IE=0x0501 -DWIN32_LEAN_AND_MEAN -D_FILE_OFFSET_BITS=64 -DPROVIDE_FUZZ_MAIN_FUNCTION
  CXX             = /usr/bin/ccache x86_64-w64-mingw32-g++ -std=c++17
  CXXFLAGS        =  -fdebug-prefix-map=$(abs_top_srcdir)=.  -fstack-reuse=none -Wstack-protector -fstack-protector-all     -pipe -O2  -fno-extended-identifiers -fvisibility=hidden
  LDFLAGS         = -lpthread  -Wl,--dynamicbase -Wl,--nxcompat -Wl,--high-entropy-va -pie  -L/home/ubuntu/src/depends/x86_64-w64-mingw32/lib  -Wl,--major-subsystem-version -Wl,6 -Wl,--minor-subsystem-version -Wl,1
  ARFLAGS         = cr


real    0m22.332s
user    0m17.464s
sys     0m3.975s
+ timeblock_end CONFIGURE
++ date +%s
+ echo -e '\n###END#CONFIGURE#1634140094\n\n\n'

###END#CONFIGURE#1634140094



+ timeblock_start COMPILE_AND_INSTALL
++ date +%s
+ echo -e '\n###START#COMPILE_AND_INSTALL#1634140094\n'

###START#COMPILE_AND_INSTALL#1634140094

+ make deploy -j4
Making all in src
make[1]: Entering directory '/home/ubuntu/src/src'
make[2]: Entering directory '/home/ubuntu/src/src'
  CXX      libbitcoinconsensus_la-arith_uint256.lo
  CXX      libbitcoinconsensus_la-hash.lo
  CXX      libbitcoinconsensus_la-pubkey.lo
  CXX      libbitcoinconsensus_la-uint256.lo
In file included from uint256.cpp:8:0:
./util/strencodings.h:16:10: fatal error: charconv: No such file or directory
 #include <charconv>
          ^~~~~~~~~~
compilation terminated.
Makefile:11856: recipe for target 'libbitcoinconsensus_la-uint256.lo' failed
make[2]: *** [libbitcoinconsensus_la-uint256.lo] Error 1
make[2]: *** Waiting for unfinished jobs....
make[2]: Leaving directory '/home/ubuntu/src/src'
Makefile:15650: recipe for target 'all-recursive' failed
make[1]: *** [all-recursive] Error 1
make[1]: Leaving directory '/home/ubuntu/src/src'
Makefile:818: recipe for target 'all-recursive' failed
make: *** [all-recursive] Error 1

real    0m1.356s
user    0m2.841s
sys     0m0.306s
Build finished with exit code 2
#BUILD#c182867e-d6e5-48be-a14d-6c03fa3d18cd#: 2