« part of build 200  

Details for job accdf3ee-b858-4257-84b1-a540393c1c4d

failed

Name Win64
Success failed
Build Time 00:01:21
Git Head bc06d15624985ebb56b8dadcbaf8f3657225edf3
PR 19419
Worker # 2
Base Image ubuntu1804_full_base

Pull request info

Pull# 19419
Title
Head
Mergable
Changes
Comments
User

Tasks time consumption

00:00:16 - GIT_CHECKOUT
00:00:04 - APT_INSTALL
00:00:00 - RESTORE_CACHE
00:00:02 - MAKE_DEPENDS
00:00:00 - UPDATE_DEPENDENCY_CACHE
00:00:22 - CONFIGURE

Build log tail

        CXX      libbitcoin_util_a-random.o
  CXX      libbitcoin_util_a-randomenv.o
  CXX      rpc/libbitcoin_util_a-request.o
  CXX      support/libbitcoin_util_a-cleanse.o
  CXX      libbitcoin_util_a-threadinterrupt.o
  CXX      libbitcoin_util_a-sync.o
  CXX      util/libbitcoin_util_a-asmap.o
gcc -Wall -Wextra -Wno-unused-function -g -O2  gen_context.o -o gen_context
  CXX      util/libbitcoin_util_a-bip32.o
  CXX      util/libbitcoin_util_a-bytevectorhash.o
./gen_context
  CXX      util/libbitcoin_util_a-error.o
  CC       src/libsecp256k1_la-secp256k1.lo
  CXX      util/libbitcoin_util_a-fees.o
  CXX      util/libbitcoin_util_a-message.o
  CXX      util/libbitcoin_util_a-system.o
  CXX      util/libbitcoin_util_a-moneystr.o
  CXX      util/libbitcoin_util_a-rbf.o
  CXX      util/libbitcoin_util_a-settings.o
  CXX      util/libbitcoin_util_a-threadnames.o
  CXX      util/libbitcoin_util_a-spanparsing.o
  CXX      util/libbitcoin_util_a-strencodings.o
  CXX      util/libbitcoin_util_a-string.o
  CXX      util/libbitcoin_util_a-time.o
  CXX      util/libbitcoin_util_a-url.o
  CXX      libbitcoin_consensus_a-arith_uint256.o
  CXX      consensus/libbitcoin_consensus_a-merkle.o
make[3]: Entering directory '/home/ubuntu/src/src/univalue'
  CXX      consensus/libbitcoin_consensus_a-tx_check.o
  CXX      lib/libunivalue_la-univalue.lo
  CXX      lib/libunivalue_la-univalue_get.lo
  CXX      lib/libunivalue_la-univalue_read.lo
  CCLD     libsecp256k1.la
  CXX      lib/libunivalue_la-univalue_write.lo
  CXX      libbitcoin_consensus_a-hash.o
  CXX      primitives/libbitcoin_consensus_a-block.o
  CXX      primitives/libbitcoin_consensus_a-transaction.o
libtool: warning: undefined symbols not allowed in x86_64-w64-mingw32 shared libraries; building static only
  CXX      libbitcoin_consensus_a-pubkey.o
  CXX      script/libbitcoin_consensus_a-bitcoinconsensus.o
/usr/bin/x86_64-w64-mingw32-ar: `u' modifier ignored since `D' is the default (see `U')
  CXX      script/libbitcoin_consensus_a-interpreter.o
  CXX      script/libbitcoin_consensus_a-script.o
  CXX      script/libbitcoin_consensus_a-script_error.o
  CXX      libbitcoin_consensus_a-uint256.o
make[3]: Leaving directory '/home/ubuntu/src/src/secp256k1'
  CXX      util/libbitcoin_consensus_a-strencodings.o
  CXX      crypto/crypto_libbitcoin_crypto_base_a-aes.o
  CXX      crypto/crypto_libbitcoin_crypto_base_a-chacha20.o
  CXX      crypto/crypto_libbitcoin_crypto_base_a-chacha_poly_aead.o
  CXX      crypto/crypto_libbitcoin_crypto_base_a-hkdf_sha256_32.o
  CXX      crypto/crypto_libbitcoin_crypto_base_a-hmac_sha256.o
  CXX      crypto/crypto_libbitcoin_crypto_base_a-hmac_sha512.o
  CXX      crypto/crypto_libbitcoin_crypto_base_a-poly1305.o
  CXX      crypto/crypto_libbitcoin_crypto_base_a-ripemd160.o
  CXX      crypto/crypto_libbitcoin_crypto_base_a-sha256.o
  CXX      crypto/crypto_libbitcoin_crypto_base_a-sha1.o
  CXX      crypto/crypto_libbitcoin_crypto_base_a-sha512.o
  CXX      crypto/crypto_libbitcoin_crypto_base_a-siphash.o
  CXX      crypto/crypto_libbitcoin_crypto_base_a-sha256_sse4.o
  CXX      crypto/crypto_libbitcoin_crypto_sse41_a-sha256_sse41.o
  CXX      crypto/crypto_libbitcoin_crypto_avx2_a-sha256_avx2.o
  CXX      crypto/crypto_libbitcoin_crypto_shani_a-sha256_shani.o
wallet/walletutil.cpp: In function ‘std::vector<boost::filesystem::path> ListWalletDir()’:
wallet/walletutil.cpp:77:57: error: cannot convert ‘const value_type* {aka const wchar_t*}’ to ‘const char*’ for argument ‘1’ to ‘char* strstr(const char*, const char*)’
             if (strstr(sub_dir->path().c_str(), "blocks")) continue;
                                                         ^
wallet/walletutil.cpp:78:58: error: cannot convert ‘const value_type* {aka const wchar_t*}’ to ‘const char*’ for argument ‘1’ to ‘char* strstr(const char*, const char*)’
             if (strstr(sub_dir->path().c_str(), "testnet")) continue;
                                                          ^
wallet/walletutil.cpp:79:58: error: cannot convert ‘const value_type* {aka const wchar_t*}’ to ‘const char*’ for argument ‘1’ to ‘char* strstr(const char*, const char*)’
             if (strstr(sub_dir->path().c_str(), "regtest")) continue;
                                                          ^
wallet/walletutil.cpp:80:61: error: cannot convert ‘const value_type* {aka const wchar_t*}’ to ‘const char*’ for argument ‘1’ to ‘char* strstr(const char*, const char*)’
             if (strstr(sub_dir->path().c_str(), "chainstate")) continue;
                                                             ^
wallet/walletutil.cpp:81:59: error: cannot convert ‘const value_type* {aka const wchar_t*}’ to ‘const char*’ for argument ‘1’ to ‘char* strstr(const char*, const char*)’
             if (strstr(sub_dir->path().c_str(), "database")) continue;
                                                           ^
wallet/walletutil.cpp:82:58: error: cannot convert ‘const value_type* {aka const wchar_t*}’ to ‘const char*’ for argument ‘1’ to ‘char* strstr(const char*, const char*)’
             if (strstr(sub_dir->path().c_str(), "indexes")) continue;
                                                          ^
Makefile:11756: recipe for target 'wallet/libbitcoin_wallet_a-walletutil.o' failed
make[2]: *** [wallet/libbitcoin_wallet_a-walletutil.o] Error 1
make[2]: *** Waiting for unfinished jobs....
  CXXLD    libunivalue.la
x86_64-w64-mingw32-ar: `u' modifier ignored since `D' is the default (see `U')
make[3]: Leaving directory '/home/ubuntu/src/src/univalue'
make[2]: Leaving directory '/home/ubuntu/src/src'
Makefile:17655: recipe for target 'all-recursive' failed
make[1]: *** [all-recursive] Error 1
make[1]: Leaving directory '/home/ubuntu/src/src'
Makefile:788: recipe for target 'all-recursive' failed
make: *** [all-recursive] Error 1

real    0m4.046s
user    0m10.184s
sys     0m1.216s
Build finished with exit code 2
#BUILD#accdf3ee-b858-4257-84b1-a540393c1c4d#: 2