« part of build 14346  

Details for job a86ee7b2-d767-44da-b8bc-7d3547460d8a

failed

Name Linux x86_64 - system libs, fuzz
Success failed
Build Time 00:03:52
Git Head c2375de502c19f873469abe3884ba678b341d6d2
PR 15294
Worker # 3
Base Image ubuntu1804_full_base

Pull request info

Pull# 15294
Title
Head
Mergable
Changes
Comments
User

Tasks time consumption

00:00:14 - GIT_CHECKOUT
00:00:19 - APT_INSTALL
00:00:00 - RESTORE_CACHE
00:00:16 - CONFIGURE

Build log tail

        with wallet     = no
  with gui / qt   = no
  with zmq        = no
  with test       = not building test_bitcoin because fuzzing is enabled
    with fuzz     = yes
  with bench      = no
  with upnp       = no
  with natpmp     = no
  use asm         = yes
  ebpf tracing    = no
  sanitizers      = fuzzer,address,undefined
  debug enabled   = no
  gprof enabled   = no
  werror          = no

  target os       = linux
  build os        = linux-gnu

  CC              = /usr/bin/ccache clang-8
  CFLAGS          = -pthread -g -O2
  CPPFLAGS        =  -DABORT_ON_FAILED_ASSUME  -U_FORTIFY_SOURCE -D_FORTIFY_SOURCE=2  -DHAVE_BUILD_INFO -D__STDC_FORMAT_MACROS
  CXX             = /usr/bin/ccache clang++-8 -std=c++17
  CXXFLAGS        =  -fdebug-prefix-map=$(abs_top_srcdir)=.  -Wstack-protector -fstack-protector-all -fcf-protection=full  -Wall -Wextra -Wgnu -Wformat -Wformat-security -Wvla -Wshadow-field -Wswitch -Wthread-safety -Wrange-loop-analysis -Wredundant-decls -Wunused-variable -Wunused-member-function -Wdate-time -Wconditional-uninitialized -Wsign-compare -Woverloaded-virtual -Wunreachable-code-loop-increment -Wimplicit-fallthrough -Wdocumentation  -Wno-unused-parameter -Wno-self-assign -Wno-unused-local-typedef   -g -O2
  LDFLAGS         = -lpthread  -Wl,-z,relro -Wl,-z,now -Wl,-z,separate-code -pie  
  ARFLAGS         = cr


real    0m15.867s
user    0m11.835s
sys     0m3.967s
+ timeblock_end CONFIGURE
++ date +%s
+ echo -e '\n###END#CONFIGURE#1634140245\n\n\n'

###END#CONFIGURE#1634140245



+ timeblock_start COMPILE_AND_INSTALL
++ date +%s
+ echo -e '\n###START#COMPILE_AND_INSTALL#1634140245\n'

###START#COMPILE_AND_INSTALL#1634140245

+ make install -j4
Making install in src
make[1]: Entering directory '/home/ubuntu/src/src'
make[2]: Entering directory '/home/ubuntu/src/src'
  CXX      libbitcoin_server_a-addrdb.o
  CXX      libbitcoin_server_a-addrman.o
  CXX      libbitcoin_server_a-banman.o
  CXX      libbitcoin_server_a-blockencodings.o
In file included from addrman.cpp:6:
In file included from ./addrman.h:9:
In file included from ./netaddress.h:19:
./util/strencodings.h:16:10: fatal error: 'charconv' file not found
#include <charconv>
         ^~~~~~~~~~
In file included from banman.cpp:8:
In file included from ./netaddress.h:19:
./util/strencodings.h:16:10: fatal error: 'charconv' file not found
#include <charconv>
         ^~~~~~~~~~
1 error generated.
Makefile:8223: recipe for target 'libbitcoin_server_a-banman.o' failed
make[2]: *** [libbitcoin_server_a-banman.o] Error 1
make[2]: *** Waiting for unfinished jobs....
In file included from blockencodings.cpp:8:
In file included from ./chainparams.h:11:
In file included from ./netaddress.h:19:
./util/strencodings.h:16:10: fatal error: 'charconv' file not found
#include <charconv>
         ^~~~~~~~~~
1 error generated.
Makefile:8209: recipe for target 'libbitcoin_server_a-addrman.o' failed
make[2]: *** [libbitcoin_server_a-addrman.o] Error 1
In file included from addrdb.cpp:8:
In file included from ./addrman.h:9:
In file included from ./netaddress.h:19:
./util/strencodings.h:16:10: fatal error: 'charconv' file not found
#include <charconv>
         ^~~~~~~~~~
1 error generated.
Makefile:8195: recipe for target 'libbitcoin_server_a-addrdb.o' failed
make[2]: *** [libbitcoin_server_a-addrdb.o] Error 1
1 error generated.
Makefile:8237: recipe for target 'libbitcoin_server_a-blockencodings.o' failed
make[2]: *** [libbitcoin_server_a-blockencodings.o] Error 1
make[2]: Leaving directory '/home/ubuntu/src/src'
Makefile:15650: recipe for target 'install-recursive' failed
make[1]: *** [install-recursive] Error 1
make[1]: Leaving directory '/home/ubuntu/src/src'
Makefile:818: recipe for target 'install-recursive' failed
make: *** [install-recursive] Error 1

real    0m1.394s
user    0m3.064s
sys     0m0.278s
Build finished with exit code 2
#BUILD#a86ee7b2-d767-44da-b8bc-7d3547460d8a#: 2