« part of build 4101  

Details for job a7e941f5-6511-4434-aa79-894f9d2936f1

failed

Name macOS
Success failed
Build Time 00:17:18
Git Head 11326af5b4daeea4a4e21f0e7e5338cef527190a
PR 17650
Worker # 6
Base Image ubuntu1804_full_base

Pull request info

Pull# 17650
Title
Head
Mergable
Changes
Comments
User

Tasks time consumption

00:00:12 - GIT_CHECKOUT
00:12:07 - APT_INSTALL
00:00:00 - RESTORE_CACHE
00:00:03 - MAKE_DEPENDS
00:00:02 - UPDATE_DEPENDENCY_CACHE
00:00:12 - CONFIGURE

Build log tail

      /home/ubuntu/src/depends/x86_64-apple-darwin14/native/bin/x86_64-apple-darwin14-ranlib: file: libbitcoin_util.a(libbitcoin_util_a-sync.o) has no symbols
/home/ubuntu/src/depends/x86_64-apple-darwin14/native/bin/x86_64-apple-darwin14-ranlib: file: libbitcoin_util.a(libbitcoin_util_a-string.o) has no symbols
  AR       libbitcoin_zmq.a
  AR       leveldb/libleveldb.a
  AR       leveldb/libleveldb_sse42.a
  AR       leveldb/libmemenv.a
  CXXLD    bitcoin-cli
clang: warning: argument unused during compilation: '-pthread'
clang: warning: argument unused during compilation: '-pthread'
  CXXLD    bitcoin-tx
  CXXLD    bitcoin-wallet
  AR       libtest_util.a
  CXX      qt/qt_bitcoin_qt-main.o
  CXX      qt/qt_libbitcoinqt_a-bantablemodel.o
  CXX      qt/qt_libbitcoinqt_a-bitcoin.o
  CXX      qt/qt_libbitcoinqt_a-bitcoinaddressvalidator.o
  CXX      qt/qt_libbitcoinqt_a-bitcoinamountfield.o
  CXX      qt/qt_libbitcoinqt_a-bitcoingui.o
  CXX      qt/qt_libbitcoinqt_a-bitcoinunits.o
  CXX      qt/qt_libbitcoinqt_a-clientmodel.o
  CXX      qt/qt_libbitcoinqt_a-csvmodelwriter.o
  CXX      qt/qt_libbitcoinqt_a-guiutil.o
  CXX      qt/qt_libbitcoinqt_a-intro.o
  CXX      qt/qt_libbitcoinqt_a-modaloverlay.o
  CXX      qt/qt_libbitcoinqt_a-networkstyle.o
  CXX      qt/qt_libbitcoinqt_a-notificator.o
  CXX      qt/qt_libbitcoinqt_a-optionsdialog.o
  CXX      qt/qt_libbitcoinqt_a-optionsmodel.o
  CXX      qt/qt_libbitcoinqt_a-peertablemodel.o
qt/notificator.cpp:50:21: error: allocation of incomplete type 'QDBusInterface'
    interface = new QDBusInterface("org.freedesktop.Notifications",
                    ^~~~~~~~~~~~~~
./qt/notificator.h:19:7: note: forward declaration of 'QDBusInterface'
class QDBusInterface;
      ^
qt/notificator.cpp:52:17: error: member access into incomplete type 'QDBusInterface'
    if(interface->isValid())
                ^
./qt/notificator.h:19:7: note: forward declaration of 'QDBusInterface'
class QDBusInterface;
      ^
qt/notificator.cpp:68:5: warning: deleting pointer to incomplete type 'QDBusInterface' may cause undefined behavior [-Wdelete-incomplete]
    delete interface;
    ^      ~~~~~~~~~
./qt/notificator.h:19:7: note: forward declaration of 'QDBusInterface'
class QDBusInterface;
      ^
qt/notificator.cpp:93:12: error: unknown type name 'QDBusArgument'
    friend QDBusArgument &operator<<(QDBusArgument &a, const FreedesktopImage &i);
           ^
qt/notificator.cpp:93:38: error: unknown type name 'QDBusArgument'
    friend QDBusArgument &operator<<(QDBusArgument &a, const FreedesktopImage &i);
                                     ^
qt/notificator.cpp:94:18: error: unknown type name 'QDBusArgument'
    friend const QDBusArgument &operator>>(const QDBusArgument &a, FreedesktopImage &i);
                 ^
qt/notificator.cpp:94:50: error: unknown type name 'QDBusArgument'
    friend const QDBusArgument &operator>>(const QDBusArgument &a, FreedesktopImage &i);
                                                 ^
qt/notificator.cpp:128:1: error: unknown type name 'QDBusArgument'
QDBusArgument &operator<<(QDBusArgument &a, const FreedesktopImage &i)
^
qt/notificator.cpp:128:27: error: unknown type name 'QDBusArgument'
QDBusArgument &operator<<(QDBusArgument &a, const FreedesktopImage &i)
                          ^
qt/notificator.cpp:136:7: error: unknown type name 'QDBusArgument'
const QDBusArgument &operator>>(const QDBusArgument &a, FreedesktopImage &i)
      ^
qt/notificator.cpp:136:39: error: unknown type name 'QDBusArgument'
const QDBusArgument &operator>>(const QDBusArgument &a, FreedesktopImage &i)
                                      ^
qt/notificator.cpp:146:12: error: no template named 'qDBusRegisterMetaType'; did you mean 'qRegisterMetaType'?
    return qDBusRegisterMetaType<FreedesktopImage>();
           ^~~~~~~~~~~~~~~~~~~~~
           qRegisterMetaType
/home/ubuntu/src/depends/x86_64-apple-darwin14/include/QtCore/qmetatype.h:1749:43: note: 'qRegisterMetaType' declared here
QT_DEPRECATED inline Q_DECL_CONSTEXPR int qRegisterMetaType(T *)
                                          ^
qt/notificator.cpp:208:14: error: member access into incomplete type 'QDBusInterface'
    interface->callWithArgumentList(QDBus::NoBlock, "Notify", args);
             ^
./qt/notificator.h:19:7: note: forward declaration of 'QDBusInterface'
class QDBusInterface;
      ^
1 warning and 12 errors generated.
Makefile:9187: recipe for target 'qt/qt_libbitcoinqt_a-notificator.o' failed
make[2]: *** [qt/qt_libbitcoinqt_a-notificator.o] Error 1
make[2]: *** Waiting for unfinished jobs....
make[2]: Leaving directory '/home/ubuntu/src/src'
Makefile:13434: recipe for target 'all-recursive' failed
make[1]: *** [all-recursive] Error 1
make[1]: Leaving directory '/home/ubuntu/src/src'
Makefile:773: recipe for target 'all-recursive' failed
make: *** [all-recursive] Error 1

real    4m13.102s
user    10m48.391s
sys     0m24.399s
Build finished with exit code 2
#BUILD#a7e941f5-6511-4434-aa79-894f9d2936f1#: 2