« part of build 15472  

Details for job 870f5b19-cc7f-4263-95f5-10e641bf5010

failed

Name ARM
Success failed
Build Time 00:01:45
Git Head 76392b042e98fcdb3b7ce3c2023003910326d14e
Branch master
Worker # 5
Base Image ubuntu1804_full_base

Tasks time consumption

00:00:15 - GIT_CHECKOUT
00:00:22 - APT_INSTALL
00:00:01 - RESTORE_CACHE
00:00:03 - MAKE_DEPENDS
00:00:02 - UPDATE_DEPENDENCY_CACHE
00:00:20 - CONFIGURE

Build log tail

        module recovery         = yes
  module extrakeys        = yes
  module schnorrsig       = yes

  asm                     = no
  ecmult window size      = 15
  ecmult gen prec. bits   = 4

  valgrind                = no
  CC                      = arm-linux-gnueabihf-gcc
  CPPFLAGS                =  -I/home/ubuntu/src/depends/arm-linux-gnueabihf/include/ 
  SECP_CFLAGS             = -O2  -std=c89 -pedantic -Wno-long-long -Wnested-externs -Wshadow -Wstrict-prototypes -Wundef -Wno-overlength-strings -Wall -Wno-unused-function -Wextra -Wcast-align -fvisibility=hidden 
  CFLAGS                  = -pipe -O2 
  LDFLAGS                 = -L/home/ubuntu/src/depends/arm-linux-gnueabihf/lib 

  CC_FOR_BUILD            = gcc
  CPPFLAGS_FOR_BUILD      = 
  SECP_CFLAGS_FOR_BUILD   = -O2  -std=c89 -pedantic -Wno-long-long -Wnested-externs -Wshadow -Wstrict-prototypes -Wundef -Wno-overlength-strings -Wall -Wno-unused-function -Wextra -Wcast-align -fvisibility=hidden
  CFLAGS_FOR_BUILD        = -g -O2
  LDFLAGS_FOR_BUILD       = 

Options used to compile and link:
  external signer = yes
  multiprocess    = no
  with experimental syscall sandbox support = no
  with libs       = yes
  with wallet     = yes
    with sqlite   = yes
    with bdb      = yes
  with gui / qt   = yes
    with qr       = yes
  with zmq        = yes
  with test       = yes
  with bench      = yes
  with upnp       = yes
  with natpmp     = yes
  use asm         = yes
  ebpf tracing    = no
  sanitizers      = 
  debug enabled   = no
  gprof enabled   = no
  werror          = no

  target os       = linux
  build os        = linux-gnu

  CC              = /usr/bin/ccache arm-linux-gnueabihf-gcc
  CFLAGS          = -pthread -pipe -O2 
  CPPFLAGS        =   -U_FORTIFY_SOURCE -D_FORTIFY_SOURCE=2 -I/home/ubuntu/src/depends/arm-linux-gnueabihf/include/  -DHAVE_BUILD_INFO -D_FILE_OFFSET_BITS=64 -DPROVIDE_FUZZ_MAIN_FUNCTION
  CXX             = /usr/bin/ccache arm-linux-gnueabihf-g++ -std=c++17
  CXXFLAGS        =  -fdebug-prefix-map=$(abs_top_srcdir)=.  -fstack-reuse=none -Wstack-protector -fstack-protector-all     -pipe -O2 -Wno-psabi -fno-extended-identifiers -fvisibility=hidden
  LDFLAGS         = -lpthread  -Wl,-z,relro -Wl,-z,now -Wl,-z,separate-code -pie  -L/home/ubuntu/src/depends/arm-linux-gnueabihf/lib 
  ARFLAGS         = cr


real    0m19.914s
user    0m17.208s
sys     0m4.207s
+ timeblock_end CONFIGURE
++ date +%s
+ echo -e '\n###END#CONFIGURE#1637838206\n\n\n'

###END#CONFIGURE#1637838206



+ timeblock_start COMPILE_AND_INSTALL
++ date +%s
+ echo -e '\n###START#COMPILE_AND_INSTALL#1637838206\n'

###START#COMPILE_AND_INSTALL#1637838206

+ make install -j4
Making install in src
make[1]: Entering directory '/home/ubuntu/src/src'
make[2]: Entering directory '/home/ubuntu/src/src'
  CXX      libbitcoinconsensus_la-arith_uint256.lo
  CXX      libbitcoinconsensus_la-hash.lo
  CXX      libbitcoinconsensus_la-pubkey.lo
  CXX      libbitcoinconsensus_la-uint256.lo
In file included from uint256.cpp:8:0:
./util/strencodings.h:16:10: fatal error: charconv: No such file or directory
 #include <charconv>
          ^~~~~~~~~~
compilation terminated.
Makefile:12528: recipe for target 'libbitcoinconsensus_la-uint256.lo' failed
make[2]: *** [libbitcoinconsensus_la-uint256.lo] Error 1
make[2]: *** Waiting for unfinished jobs....
make[2]: Leaving directory '/home/ubuntu/src/src'
Makefile:16479: recipe for target 'install-recursive' failed
make[1]: *** [install-recursive] Error 1
make[1]: Leaving directory '/home/ubuntu/src/src'
Makefile:815: recipe for target 'install-recursive' failed
make: *** [install-recursive] Error 1

real    0m1.050s
user    0m2.448s
sys     0m0.255s
Build finished with exit code 2
#BUILD#870f5b19-cc7f-4263-95f5-10e641bf5010#: 2