« part of build 4096  

Details for job 839136c4-ee47-4ea2-aa35-85fe2be9fee9

failed

Name Linux32
Success failed
Build Time 00:15:41
Git Head 07bcabd0441a4402517e24c0e3670c581f13434a
PR 15761
Worker # 4
Base Image ubuntu1804_full_base

Pull request info

Pull# 15761
Title
Head
Mergable
Changes
Comments
User

Tasks time consumption

00:00:14 - GIT_CHECKOUT
00:12:11 - APT_INSTALL
00:00:01 - RESTORE_CACHE

Build log tail

      sys     0m0.968s
+ STORENAME=refs/pull/15761/merge
+ [[ ! -z refs/pull/15761/merge ]]
+ '[' refs/pull/15761/merge '!=' master ']'
++ echo refs/pull/15761/merge
++ md5sum
++ cut -f1 '-d '
+ STORENAME=fdcef835e72c491d2b76ca32c0de37e5
+ '[' 1 -eq 1 ']'
+ mkdir -p depends/SDKs depends/sdk-sources
+ '[' -n '' ']'
+ '[' -n '' ']'
+ timeblock_start MAKE_DEPENDS
++ date +%s
+ echo -e '\n###START#MAKE_DEPENDS#1575328346\n'

###START#MAKE_DEPENDS#1575328346

+ cd depends
+ make HOST=i686-pc-linux-gnu -j4
Fetching qtbase-opensource-src-5.9.8.tar.xz from https://download.qt.io/official_releases/qt/5.9/5.9.8/submodules
  % Total    % Received % Xferd  Average Speed   Time    Time     Time  Current
                                 Dload  Upload   Total   Spent    Left  Speed

  0     0    0     0    0     0      0      0 --:--:-- --:--:-- --:--:--     0
100   280  100   280    0     0   3333      0 --:--:-- --:--:-- --:--:--  3333

 70 43.1M   70 30.5M    0     0  35.5M      0  0:00:01 --:--:--  0:00:01 35.5M
100 43.1M  100 43.1M    0     0  42.3M      0  0:00:01  0:00:01 --:--:-- 79.4M
/home/ubuntu/src/depends/work/download/qt-5.9.8/qtbase-opensource-src-5.9.8.tar.xz.temp: OK
Fetching qttranslations-opensource-src-5.9.8.tar.xz from https://download.qt.io/official_releases/qt/5.9/5.9.8/submodules
  % Total    % Received % Xferd  Average Speed   Time    Time     Time  Current
                                 Dload  Upload   Total   Spent    Left  Speed

  0     0    0     0    0     0      0      0 --:--:-- --:--:-- --:--:--     0
100   288  100   288    0     0   9600      0 --:--:-- --:--:-- --:--:--  9600

100 1344k  100 1344k    0     0  5071k      0 --:--:-- --:--:-- --:--:-- 5071k
/home/ubuntu/src/depends/work/download/qt-5.9.8/qttranslations-opensource-src-5.9.8.tar.xz.temp: OK
Fetching qttools-opensource-src-5.9.8.tar.xz from https://download.qt.io/official_releases/qt/5.9/5.9.8/submodules
  % Total    % Received % Xferd  Average Speed   Time    Time     Time  Current
                                 Dload  Upload   Total   Spent    Left  Speed

  0     0    0     0    0     0      0      0 --:--:-- --:--:-- --:--:--     0
100   281  100   281    0     0  12217      0 --:--:-- --:--:-- --:--:-- 12217

 52 9350k   52 4954k    0     0  15.2M      0 --:--:-- --:--:-- --:--:-- 15.2M
100 9350k  100 9350k    0     0  25.2M      0 --:--:-- --:--:-- --:--:-- 97.5M
/home/ubuntu/src/depends/work/download/qt-5.9.8/qttools-opensource-src-5.9.8.tar.xz.temp: OK
Extracting qt...
/home/ubuntu/src/depends/sources/qtbase-opensource-src-5.9.8.tar.xz: OK
/home/ubuntu/src/depends/sources/qttranslations-opensource-src-5.9.8.tar.xz: OK
/home/ubuntu/src/depends/sources/qttools-opensource-src-5.9.8.tar.xz: OK
Preprocessing qt...
patching file qtbase/mkspecs/features/qt_module.prf
Hunk #1 succeeded at 264 (offset 19 lines).
patching file qtbase/mkspecs/features/mac/sdk.prf
patching file qtbase/configure
patching file qtbase/src/plugins/platforms/cocoa/qprintengine_mac_p.h
patching file qtbase/src/plugins/plugins.pro
patching file qtbase/src/tools/rcc/rcc.cpp
patching file qtbase/src/gui/configure.pri
patching file qtbase/mkspecs/android-clang/qmake.conf
patching file qtbase/src/plugins/platforms/android/androidjnimain.cpp
patching file qtbase/src/3rdparty/double-conversion/include/double-conversion/utils.h
patching file qtbase/src/plugins/platforms/xcb/qxcbcursor.cpp
Configuring qt...
Creating qmake...
make[1]: Entering directory '/home/ubuntu/src/depends/work/build/i686-pc-linux-gnu/qt/5.9.8-3daf4ac9005/qtbase/qmake'
make[1]: Leaving directory '/home/ubuntu/src/depends/work/build/i686-pc-linux-gnu/qt/5.9.8-3daf4ac9005/qtbase/qmake'
Info: creating cache file /home/ubuntu/src/depends/work/build/i686-pc-linux-gnu/qt/5.9.8-3daf4ac9005/qtbase/.qmake.cache
Command line: -bindir /home/ubuntu/src/depends/i686-pc-linux-gnu/native/bin -c++std c++11 -confirm-license -hostprefix /home/ubuntu/src/depends/i686-pc-linux-gnu/native -no-compile-examples -no-cups -no-egl -no-eglfs -no-freetype -no-gif -no-glib -no-icu -no-ico -no-iconv -no-kms -no-linuxfb -no-libjpeg -no-libudev -no-mtdev -no-openssl -no-openvg -no-reduce-relocations -no-qml-debug -no-securetransport -no-sql-db2 -no-sql-ibase -no-sql-oci -no-sql-tds -no-sql-mysql -no-sql-odbc -no-sql-psql -no-sql-sqlite -no-sql-sqlite2 -no-use-gold-linker -no-xinput2 -nomake examples -nomake tests -opensource -optimized-qmake -pch -pkg-config -prefix /home/ubuntu/src/depends/i686-pc-linux-gnu -qt-libpng -qt-pcre -qt-harfbuzz -system-zlib -static -silent -v -no-feature-bearermanagement -no-feature-colordialog -no-feature-commandlineparser -no-feature-concurrent -no-feature-dial -no-feature-filesystemwatcher -no-feature-fontcombobox -no-feature-ftp -no-feature-image_heuristic_mask -no-feature-keysequenceedit -no-feature-lcdnumber -no-feature-pdf -no-feature-printdialog -no-feature-printer -no-feature-printpreviewdialog -no-feature-printpreviewwidget -no-feature-regularexpression -no-feature-sessionmanager -no-feature-sql -no-feature-statemachine -no-feature-syntaxhighlighter -no-feature-textbrowser -no-feature-textodfwriter -no-feature-topleveldomain -no-feature-udpsocket -no-feature-undocommand -no-feature-undogroup -no-feature-undostack -no-feature-undoview -no-feature-vnc -no-feature-wizard -no-feature-xml -release -qt-xkbcommon-x11 -qt-xcb -no-xcb-xlib -no-feature-xlib -system-freetype -fontconfig -no-opengl -dbus-runtime -xplatform linux-g++-32
Info: creating stash file /home/ubuntu/src/depends/work/build/i686-pc-linux-gnu/qt/5.9.8-3daf4ac9005/qtbase/.qmake.stash

This is the Qt Open Source Edition.

You have already accepted the terms of the Open Source license.

Running configuration tests...
Checking for machine tuple... 
+ g++ -dumpmachine
> x86_64-linux-gnu
test config.qtbase.tests.machineTuple succeeded
Checking for valid makespec... 
+ cd /home/ubuntu/src/depends/work/build/i686-pc-linux-gnu/qt/5.9.8-3daf4ac9005/qtbase/config.tests/verifyspec && /home/ubuntu/src/depends/work/build/i686-pc-linux-gnu/qt/5.9.8-3daf4ac9005/qtbase/bin/qmake "CONFIG -= qt debug_and_release app_bundle lib_bundle" "CONFIG += static warn_off console single_arch" -early "CONFIG += cross_compile" /home/ubuntu/src/depends/work/build/i686-pc-linux-gnu/qt/5.9.8-3daf4ac9005/qtbase/config.tests/verifyspec
> Info: creating stash file /home/ubuntu/src/depends/work/build/i686-pc-linux-gnu/qt/5.9.8-3daf4ac9005/qtbase/config.tests/.qmake.stash
+ cd /home/ubuntu/src/depends/work/build/i686-pc-linux-gnu/qt/5.9.8-3daf4ac9005/qtbase/config.tests/verifyspec && MAKEFLAGS= /usr/bin/make
> make[1]: Entering directory '/home/ubuntu/src/depends/work/build/i686-pc-linux-gnu/qt/5.9.8-3daf4ac9005/qtbase/config.tests/verifyspec'
> g++ -c -m32 -pipe -pipe -O2 -I/home/ubuntu/src/depends/i686-pc-linux-gnu/include -O2 -w -fPIC  -I. -I/home/ubuntu/src/depends/work/build/i686-pc-linux-gnu/qt/5.9.8-3daf4ac9005/qtbase/mkspecs/linux-g++-32 -o verifyspec.o verifyspec.cpp
> g++ -m32 -L/home/ubuntu/src/depends/i686-pc-linux-gnu/lib -Wl,-O1 -o verifyspec verifyspec.o    
> /usr/bin/ld: cannot find Scrt1.o: No such file or directory
> /usr/bin/ld: cannot find crti.o: No such file or directory
> /usr/bin/ld: skipping incompatible /usr/lib/gcc/x86_64-linux-gnu/7/libstdc++.so when searching for -lstdc++
> /usr/bin/ld: skipping incompatible /usr/lib/gcc/x86_64-linux-gnu/7/libstdc++.a when searching for -lstdc++
> /usr/bin/ld: cannot find -lstdc++
> /usr/bin/ld: skipping incompatible //usr/lib/x86_64-linux-gnu/libm.so when searching for -lm
> /usr/bin/ld: skipping incompatible //usr/lib/x86_64-linux-gnu/libm.a when searching for -lm
> /usr/bin/ld: cannot find -lm
> /usr/bin/ld: skipping incompatible /usr/lib/gcc/x86_64-linux-gnu/7/libgcc.a when searching for -lgcc
> /usr/bin/ld: cannot find -lgcc
> collect2: error: ld returned 1 exit status
> Makefile:66: recipe for target 'verifyspec' failed
> make[1]: *** [verifyspec] Error 1
> make[1]: Leaving directory '/home/ubuntu/src/depends/work/build/i686-pc-linux-gnu/qt/5.9.8-3daf4ac9005/qtbase/config.tests/verifyspec'
Note: Also available for Linux: linux-clang linux-icc

ERROR: Cannot compile a minimal program. The toolchain or QMakeSpec is broken.
funcs.mk:251: recipe for target '/home/ubuntu/src/depends/work/build/i686-pc-linux-gnu/qt/5.9.8-3daf4ac9005/qtbase/.stamp_configured' failed
make: *** [/home/ubuntu/src/depends/work/build/i686-pc-linux-gnu/qt/5.9.8-3daf4ac9005/qtbase/.stamp_configured] Error 3
Build finished with exit code 2
#BUILD#839136c4-ee47-4ea2-aa35-85fe2be9fee9#: 2