« part of build 5043  

Details for job 7ec1f0b5-e9e8-43dd-80ff-909f9eeff823

failed

Name macOS
Success failed
Build Time 00:16:55
Git Head b0dd02010e580f63403b021246acdb44fa755724
PR 17453
Worker # 5
Base Image ubuntu1804_full_base

Pull request info

Pull# 17453
Title
Head
Mergable
Changes
Comments
User

Tasks time consumption

00:00:15 - GIT_CHECKOUT
00:12:04 - APT_INSTALL
00:00:01 - RESTORE_CACHE
00:00:02 - MAKE_DEPENDS
00:00:01 - UPDATE_DEPENDENCY_CACHE
00:00:12 - CONFIGURE

Build log tail

        CXX      test/test_test_bitcoin-txindex_tests.o
  CXX      test/test_test_bitcoin-txvalidation_tests.o
  CXX      test/test_test_bitcoin-txvalidationcache_tests.o
  CXX      test/test_test_bitcoin-uint256_tests.o
  CXX      test/test_test_bitcoin-util_tests.o
  CXX      test/test_test_bitcoin-validation_block_tests.o
  CXX      test/test_test_bitcoin-validation_flush_tests.o
  CXX      test/test_test_bitcoin-versionbits_tests.o
  CXX      wallet/test/test_test_bitcoin-db_tests.o
  CXX      wallet/test/test_test_bitcoin-psbt_wallet_tests.o
  CXX      wallet/test/test_test_bitcoin-wallet_tests.o
  CXX      wallet/test/test_test_bitcoin-wallet_crypto_tests.o
  CXX      wallet/test/test_test_bitcoin-coinselector_tests.o
  CXX      wallet/test/test_test_bitcoin-init_tests.o
  CXX      wallet/test/test_test_bitcoin-ismine_tests.o
  CXX      test/util/libtest_util_a-blockfilter.o
  CXX      test/util/libtest_util_a-logging.o
  CXX      test/util/libtest_util_a-mining.o
  CXX      test/util/libtest_util_a-setup_common.o
  CXX      test/util/libtest_util_a-str.o
  CXX      test/util/libtest_util_a-transaction_utils.o
  CXX      test/util/libtest_util_a-wallet.o
  CXX      bench/bench_bench_bitcoin-bench_bitcoin.o
  CXX      bench/bench_bench_bitcoin-bench.o
  CXX      bench/bench_bench_bitcoin-block_assemble.o
  CXX      bench/bench_bench_bitcoin-checkblock.o
  CXX      bench/bench_bench_bitcoin-checkqueue.o
  CXX      bench/bench_bench_bitcoin-data.o
  GEN      qt/bitcoinamountfield.moc
  GEN      qt/intro.moc
  GEN      qt/overviewpage.moc
  GEN      qt/rpcconsole.moc
  CXX      qt/test/qt_test_test_bitcoin_qt-apptests.o
  GEN      qt/qrc_bitcoin_locale.cpp
  CXX      qt/test/qt_test_test_bitcoin_qt-compattests.o
  CXX      qt/test/qt_test_test_bitcoin_qt-rpcnestedtests.o
  CXX      qt/test/qt_test_test_bitcoin_qt-test_main.o
  CXX      qt/test/qt_test_test_bitcoin_qt-uritests.o
  CXX      qt/test/qt_test_test_bitcoin_qt-util.o
  CXX      qt/test/qt_test_test_bitcoin_qt-addressbooktests.o
  CXX      qt/test/qt_test_test_bitcoin_qt-wallettests.o
  CXX      qt/test/qt_test_test_bitcoin_qt-moc_apptests.o
  CXX      qt/test/qt_test_test_bitcoin_qt-moc_compattests.o
  CXX      qt/test/qt_test_test_bitcoin_qt-moc_rpcnestedtests.o
  CXX      qt/test/qt_test_test_bitcoin_qt-moc_uritests.o
  CXX      qt/test/qt_test_test_bitcoin_qt-moc_addressbooktests.o
  CXX      qt/test/qt_test_test_bitcoin_qt-moc_wallettests.o
  CXXLD    libbitcoinconsensus.la
clang: warning: argument unused during compilation: '-pthread'
clang: warning: argument unused during compilation: '-pthread'
  AR       libbitcoin_server.a
  AR       libbitcoin_util.a
/home/ubuntu/src/depends/x86_64-apple-darwin14/native/bin/x86_64-apple-darwin14-ranlib: file: libbitcoin_util.a(libbitcoin_util_a-strnlen.o) has no symbols
/home/ubuntu/src/depends/x86_64-apple-darwin14/native/bin/x86_64-apple-darwin14-ranlib: file: libbitcoin_util.a(libbitcoin_util_a-sync.o) has no symbols
/home/ubuntu/src/depends/x86_64-apple-darwin14/native/bin/x86_64-apple-darwin14-ranlib: file: libbitcoin_util.a(libbitcoin_util_a-string.o) has no symbols
/home/ubuntu/src/depends/x86_64-apple-darwin14/native/bin/x86_64-apple-darwin14-ranlib: file: libbitcoin_util.a(libbitcoin_util_a-strnlen.o) has no symbols
/home/ubuntu/src/depends/x86_64-apple-darwin14/native/bin/x86_64-apple-darwin14-ranlib: file: libbitcoin_util.a(libbitcoin_util_a-sync.o) has no symbols
/home/ubuntu/src/depends/x86_64-apple-darwin14/native/bin/x86_64-apple-darwin14-ranlib: file: libbitcoin_util.a(libbitcoin_util_a-string.o) has no symbols
  AR       libbitcoin_zmq.a
  AR       leveldb/libleveldb.a
  AR       leveldb/libleveldb_sse42.a
  AR       leveldb/libmemenv.a
  CXXLD    bitcoin-cli
  CXXLD    bitcoin-tx
  CXXLD    bitcoin-wallet
  AR       libtest_util.a
  CXX      qt/qt_bitcoin_qt-main.o
  CXX      qt/qt_libbitcoinqt_a-bantablemodel.o
  CXX      qt/qt_libbitcoinqt_a-bitcoin.o
  CXX      qt/qt_libbitcoinqt_a-bitcoinaddressvalidator.o
  CXX      qt/qt_libbitcoinqt_a-bitcoinamountfield.o
  CXX      qt/qt_libbitcoinqt_a-bitcoingui.o
  CXX      qt/qt_libbitcoinqt_a-bitcoinunits.o
  CXX      qt/qt_libbitcoinqt_a-clientmodel.o
  CXX      qt/qt_libbitcoinqt_a-csvmodelwriter.o
  CXX      qt/qt_libbitcoinqt_a-guiutil.o
  CXX      qt/qt_libbitcoinqt_a-intro.o
qt/intro.cpp:359:31: error: use of undeclared identifier 'prune_target_gb'; did you mean 'm_prune_target_gb'?
        m_required_space_gb = prune_target_gb + m_chain_state_size_gb;
                              ^~~~~~~~~~~~~~~
                              m_prune_target_gb
./qt/intro.h:75:19: note: 'm_prune_target_gb' declared here
    const int64_t m_prune_target_gb;
                  ^
1 error generated.
Makefile:10145: recipe for target 'qt/qt_libbitcoinqt_a-intro.o' failed
make[2]: *** [qt/qt_libbitcoinqt_a-intro.o] Error 1
make[2]: *** Waiting for unfinished jobs....
make[2]: Leaving directory '/home/ubuntu/src/src'
Makefile:15218: recipe for target 'all-recursive' failed
make[1]: *** [all-recursive] Error 1
make[1]: Leaving directory '/home/ubuntu/src/src'
Makefile:782: recipe for target 'all-recursive' failed
make: *** [all-recursive] Error 1

real    3m49.643s
user    11m4.290s
sys     0m23.535s
Build finished with exit code 2
#BUILD#7ec1f0b5-e9e8-43dd-80ff-909f9eeff823#: 2