« part of build 15466  

Details for job 7a7b878c-c5da-47b3-8279-b2e7adccec01


Name Linux x86_64 - system libs, clang
Success failed
Build Time 00:02:20
Git Head 9facad0da65815211e166870c7c9fb24e9b921ac
Branch master
Worker # 4
Base Image ubuntu1804_full_base

Tasks time consumption

00:00:24 - GIT_CHECKOUT
00:00:53 - APT_INSTALL
00:00:00 - RESTORE_CACHE
00:00:23 - CONFIGURE

Build log tail

        module recovery         = yes
  module extrakeys        = yes
  module schnorrsig       = yes

  asm                     = x86_64
  ecmult window size      = 15
  ecmult gen prec. bits   = 4

  valgrind                = no
  CC                      = clang-10
  CPPFLAGS                =  -DDEBUG_LOCKORDER
  SECP_CFLAGS             = -O2  -std=c89 -pedantic -Wno-long-long -Wnested-externs -Wshadow -Wstrict-prototypes -Wundef -Wno-overlength-strings -Wall -Wno-unused-function -Wextra -Wcast-align -Wconditional-uninitialized -fvisibility=hidden 
  CFLAGS                  = -g -O2
  LDFLAGS                 = 

  CC_FOR_BUILD            = clang-10
  SECP_CFLAGS_FOR_BUILD   = -O2  -std=c89 -pedantic -Wno-long-long -Wnested-externs -Wshadow -Wstrict-prototypes -Wundef -Wno-overlength-strings -Wall -Wno-unused-function -Wextra -Wcast-align -Wconditional-uninitialized -fvisibility=hidden 
  CFLAGS_FOR_BUILD        = -g -O2

Options used to compile and link:
  external signer = yes
  multiprocess    = no
  with experimental syscall sandbox support = no
  with libs       = yes
  with wallet     = yes
    with sqlite   = yes
    with bdb      = yes
  with gui / qt   = yes
    with qr       = yes
  with zmq        = yes
  with test       = yes
  with bench      = yes
  with upnp       = yes
  with natpmp     = no
  use asm         = yes
  ebpf tracing    = no
  sanitizers      = address,integer,undefined
  debug enabled   = no
  gprof enabled   = no
  werror          = no

  target os       = linux
  build os        = linux-gnu

  CC              = /usr/bin/ccache clang-10
  CFLAGS          = -pthread -g -O2
  CXX             = /usr/bin/ccache clang++-10 -std=c++17
  CXXFLAGS        =  -fdebug-prefix-map=$(abs_top_srcdir)=.  -Wstack-protector -fstack-protector-all -fcf-protection=full  -Wall -Wextra -Wgnu -Wformat -Wformat-security -Wvla -Wshadow-field -Wthread-safety -Wrange-loop-analysis -Wredundant-decls -Wunused-member-function -Wdate-time -Wconditional-uninitialized -Woverloaded-virtual -Wunreachable-code-loop-increment -Wimplicit-fallthrough -Wdocumentation  -Wno-unused-parameter -Wno-self-assign   -g -O2
  LDFLAGS         = -lpthread  -Wl,-z,relro -Wl,-z,now -Wl,-z,separate-code -pie  
  ARFLAGS         = cr

real    0m23.727s
user    0m16.640s
sys     0m4.410s
+ timeblock_end CONFIGURE
++ date +%s
+ echo -e '\n###END#CONFIGURE#1637830004\n\n\n'


+ timeblock_start COMPILE_AND_INSTALL
++ date +%s
+ echo -e '\n###START#COMPILE_AND_INSTALL#1637830004\n'


+ make install -j4
Making install in src
make[1]: Entering directory '/home/ubuntu/src/src'
make[2]: Entering directory '/home/ubuntu/src/src'
  CXX      libbitcoinconsensus_la-arith_uint256.lo
  CXX      libbitcoinconsensus_la-hash.lo
  CXX      libbitcoinconsensus_la-pubkey.lo
  CXX      libbitcoinconsensus_la-uint256.lo
In file included from uint256.cpp:8:
./util/strencodings.h:16:10: fatal error: 'charconv' file not found
#include <charconv>
1 error generated.
Makefile:12528: recipe for target 'libbitcoinconsensus_la-uint256.lo' failed
make[2]: *** [libbitcoinconsensus_la-uint256.lo] Error 1
make[2]: *** Waiting for unfinished jobs....
make[2]: Leaving directory '/home/ubuntu/src/src'
Makefile:16479: recipe for target 'install-recursive' failed
make[1]: *** [install-recursive] Error 1
make[1]: Leaving directory '/home/ubuntu/src/src'
Makefile:815: recipe for target 'install-recursive' failed
make: *** [install-recursive] Error 1

real    0m3.092s
user    0m6.333s
sys     0m0.371s
Build finished with exit code 2
#BUILD#7a7b878c-c5da-47b3-8279-b2e7adccec01#: 2