« part of build 201  

Details for job 752faf68-6cf4-40b3-826e-a9a04c4506a0

failed

Name Win64
Success failed
Build Time 00:01:28
Git Head 9b4cde753ac965b614c99f0e0a54617388fbff30
PR 19419
Worker # 2
Base Image ubuntu1804_full_base

Pull request info

Pull# 19419
Title
Head
Mergable
Changes
Comments
User

Tasks time consumption

00:00:21 - GIT_CHECKOUT
00:00:04 - APT_INSTALL
00:00:01 - RESTORE_CACHE
00:00:01 - MAKE_DEPENDS
00:00:01 - UPDATE_DEPENDENCY_CACHE
00:00:22 - CONFIGURE

Build log tail

        CXX      test/test_test_bitcoin-policyestimator_tests.o
  CXX      test/test_test_bitcoin-pow_tests.o
  CXX      test/test_test_bitcoin-prevector_tests.o
  CXX      test/test_test_bitcoin-raii_event_tests.o
  CXX      test/test_test_bitcoin-random_tests.o
  CXX      test/test_test_bitcoin-ref_tests.o
  CXX      test/test_test_bitcoin-reverselock_tests.o
  CXX      test/test_test_bitcoin-rpc_tests.o
  CXX      test/test_test_bitcoin-sanity_tests.o
  CXX      test/test_test_bitcoin-scheduler_tests.o
  CXX      test/test_test_bitcoin-script_p2sh_tests.o
  CXX      test/test_test_bitcoin-script_tests.o
  CXX      test/test_test_bitcoin-script_standard_tests.o
  CXX      test/test_test_bitcoin-scriptnum_tests.o
  CXX      test/test_test_bitcoin-settings_tests.o
  CXX      test/test_test_bitcoin-serialize_tests.o
  CXX      test/test_test_bitcoin-sighash_tests.o
  CXX      test/test_test_bitcoin-sigopcount_tests.o
  CXX      test/test_test_bitcoin-skiplist_tests.o
  CXX      test/test_test_bitcoin-streams_tests.o
  CXX      test/test_test_bitcoin-sync_tests.o
  CXX      test/test_test_bitcoin-util_threadnames_tests.o
  CXX      test/test_test_bitcoin-timedata_tests.o
  CXX      test/test_test_bitcoin-torcontrol_tests.o
  CXX      test/test_test_bitcoin-txindex_tests.o
  CXX      test/test_test_bitcoin-transaction_tests.o
  CXX      test/test_test_bitcoin-txvalidation_tests.o
  CXX      test/test_test_bitcoin-uint256_tests.o
  CXX      test/test_test_bitcoin-txvalidationcache_tests.o
  CXX      test/test_test_bitcoin-util_tests.o
  CXX      test/test_test_bitcoin-validation_chainstatemanager_tests.o
  CXX      test/test_test_bitcoin-validation_block_tests.o
  CXX      test/test_test_bitcoin-validation_flush_tests.o
  CXX      test/test_test_bitcoin-validationinterface_tests.o
  CXX      test/test_test_bitcoin-versionbits_tests.o
  CXX      wallet/test/test_test_bitcoin-db_tests.o
  CXX      wallet/test/test_test_bitcoin-psbt_wallet_tests.o
  CXX      wallet/test/test_test_bitcoin-wallet_crypto_tests.o
  CXX      wallet/test/test_test_bitcoin-wallet_tests.o
  CXX      wallet/test/test_test_bitcoin-coinselector_tests.o
  CXX      wallet/test/test_test_bitcoin-init_tests.o
  CXX      wallet/test/test_test_bitcoin-ismine_tests.o
  CXX      wallet/test/test_test_bitcoin-scriptpubkeyman_tests.o
  CXX      test/util/libtest_util_a-blockfilter.o
  CXX      test/util/libtest_util_a-logging.o
  CXX      test/util/libtest_util_a-mining.o
  CXX      test/util/libtest_util_a-setup_common.o
  CXX      test/util/libtest_util_a-net.o
  CXX      test/util/libtest_util_a-str.o
  CXX      test/util/libtest_util_a-wallet.o
  CXX      test/util/libtest_util_a-transaction_utils.o
  CXX      bench/bench_bench_bitcoin-addrman.o
  CXX      bench/bench_bench_bitcoin-bench_bitcoin.o
  CXX      bench/bench_bench_bitcoin-bench.o
  CXX      bench/bench_bench_bitcoin-block_assemble.o
  CXX      bench/bench_bench_bitcoin-checkblock.o
  CXX      bench/bench_bench_bitcoin-data.o
  CXX      bench/bench_bench_bitcoin-checkqueue.o
  GEN      qt/bitcoinamountfield.moc
  GEN      qt/intro.moc
  GEN      qt/rpcconsole.moc
  GEN      qt/overviewpage.moc
  CXXLD    libbitcoinconsensus.la
  GEN      qt/qrc_bitcoin_locale.cpp
  AR       libbitcoin_server.a
wallet/walletutil.cpp: In function ‘std::vector<boost::filesystem::path> ListWalletDir()’:
wallet/walletutil.cpp:77:57: error: cannot convert ‘const value_type* {aka const wchar_t*}’ to ‘const char*’ for argument ‘1’ to ‘char* strstr(const char*, const char*)’
             if (strstr(sub_dir->path().c_str(), "blocks")) continue;
                                                         ^
wallet/walletutil.cpp:78:58: error: cannot convert ‘const value_type* {aka const wchar_t*}’ to ‘const char*’ for argument ‘1’ to ‘char* strstr(const char*, const char*)’
             if (strstr(sub_dir->path().c_str(), "testnet")) continue;
                                                          ^
wallet/walletutil.cpp:79:58: error: cannot convert ‘const value_type* {aka const wchar_t*}’ to ‘const char*’ for argument ‘1’ to ‘char* strstr(const char*, const char*)’
             if (strstr(sub_dir->path().c_str(), "regtest")) continue;
                                                          ^
wallet/walletutil.cpp:80:61: error: cannot convert ‘const value_type* {aka const wchar_t*}’ to ‘const char*’ for argument ‘1’ to ‘char* strstr(const char*, const char*)’
             if (strstr(sub_dir->path().c_str(), "chainstate")) continue;
                                                             ^
wallet/walletutil.cpp:81:59: error: cannot convert ‘const value_type* {aka const wchar_t*}’ to ‘const char*’ for argument ‘1’ to ‘char* strstr(const char*, const char*)’
             if (strstr(sub_dir->path().c_str(), "database")) continue;
                                                           ^
wallet/walletutil.cpp:82:58: error: cannot convert ‘const value_type* {aka const wchar_t*}’ to ‘const char*’ for argument ‘1’ to ‘char* strstr(const char*, const char*)’
             if (strstr(sub_dir->path().c_str(), "indexes")) continue;
                                                          ^
Makefile:11756: recipe for target 'wallet/libbitcoin_wallet_a-walletutil.o' failed
make[2]: *** [wallet/libbitcoin_wallet_a-walletutil.o] Error 1
make[2]: *** Waiting for unfinished jobs....
/usr/bin/x86_64-w64-mingw32-ar: `u' modifier ignored since `D' is the default (see `U')
make[2]: Leaving directory '/home/ubuntu/src/src'
Makefile:17655: recipe for target 'all-recursive' failed
make[1]: *** [all-recursive] Error 1
make[1]: Leaving directory '/home/ubuntu/src/src'
Makefile:788: recipe for target 'all-recursive' failed
make: *** [all-recursive] Error 1

real    0m8.449s
user    0m20.552s
sys     0m3.952s
Build finished with exit code 2
#BUILD#752faf68-6cf4-40b3-826e-a9a04c4506a0#: 2