« part of build 11512  

Details for job 71c2b75b-178f-4b0e-83cb-815bbf1522c0

failed

Name Linux32
Success failed
Build Time 00:05:38
Git Head 12ca4486bc6237e92e2dcf1bad8dc6fc61cd3e8d
PR 22219
Worker # 6
Base Image ubuntu1804_full_base

Pull request info

Pull# 22219
Title
Head
Mergable
Changes
Comments
User

Tasks time consumption

00:00:11 - GIT_CHECKOUT
00:02:10 - APT_INSTALL
00:00:02 - RESTORE_CACHE
00:00:04 - MAKE_DEPENDS
00:00:04 - UPDATE_DEPENDENCY_CACHE
00:00:22 - CONFIGURE
00:01:31 - COMPILE_AND_INSTALL
00:00:03 - UPDATE_CCACHE_CACHE

Build log tail

      ++ date +%s
+ echo -e '\n###END#UPDATE_CCACHE_CACHE#1623394405\n\n\n'

###END#UPDATE_CCACHE_CACHE#1623394405



+ '[' true = true ']'
+ timeblock_start RUN_UNIT_TESTS
++ date +%s
+ echo -e '\n###START#RUN_UNIT_TESTS#1623394405\n'

###START#RUN_UNIT_TESTS#1623394405

+ make -j4 check VERBOSE=1
Making check in src
make[1]: Entering directory '/home/ubuntu/src/src'
make[2]: Entering directory '/home/ubuntu/src/src'
make  check-TESTS check-local
make[3]: Entering directory '/home/ubuntu/src/src'
Running tests: arith_uint256_tests from test/arith_uint256_tests.cpp
Running tests: addrman_tests from test/addrman_tests.cpp
Running tests: amount_tests from test/amount_tests.cpp
make[4]: Entering directory '/home/ubuntu/src/src'
Running tests: allocator_tests from test/allocator_tests.cpp
Running tests: base32_tests from test/base32_tests.cpp
Running tests: base58_tests from test/base58_tests.cpp
Running tests: base64_tests from test/base64_tests.cpp
Running tests: bech32_tests from test/bech32_tests.cpp
Running tests: bip32_tests from test/bip32_tests.cpp
Running tests: blockchain_tests from test/blockchain_tests.cpp
Running tests: blockencodings_tests from test/blockencodings_tests.cpp
Running tests: blockfilter_tests from test/blockfilter_tests.cpp
Running tests: blockfilter_index_tests from test/blockfilter_index_tests.cpp
Running tests: bloom_tests from test/bloom_tests.cpp
Running tests: bswap_tests from test/bswap_tests.cpp
Running tests: checkqueue_tests from test/checkqueue_tests.cpp
Running tests: coins_tests from test/coins_tests.cpp
Running tests: coinstatsindex_tests from test/coinstatsindex_tests.cpp
../build-aux/test-driver: line 107: 19902 Aborted                 (core dumped) "$@" > $log_file 2>&1
FAIL: qt/test/test_bitcoin-qt
==============================================
   Bitcoin Core 21.99.0: src/test-suite.log
==============================================

# TOTAL: 1
# PASS:  0
# SKIP:  0
# XFAIL: 0
# FAIL:  1
# XPASS: 0
# ERROR: 0

.. contents:: :depth: 2

FAIL: qt/test/test_bitcoin-qt
=============================

********* Start testing of AppTests *********
Config: Using QtTest library 5.12.11, Qt 5.12.11 (i386-little_endian-ilp32 static release build; by GCC 7.5.0)
PASS   : AppTests::initTestCase()
QINFO  : AppTests::appTests() Backing up GUI settings to "/tmp/test_common_Bitcoin Core/291b423316ca3aa0ad358a99689d4a7263f3a8c272fc71b552dddd62ad814e76/regtest/guisettings.ini.bak"
test_bitcoin-qt: wallet/init.cpp:128: WalletInit::Construct(NodeContext&) const::<lambda()>: Assertion `"node.args" && check' failed.
FAIL qt/test/test_bitcoin-qt (exit status: 134)

============================================================================
Testsuite summary for Bitcoin Core 21.99.0
============================================================================
# TOTAL: 1
# PASS:  0
# SKIP:  0
# XFAIL: 0
# FAIL:  1
# XPASS: 0
# ERROR: 0
============================================================================
See src/test-suite.log
Please report to https://github.com/bitcoin/bitcoin/issues
============================================================================
Makefile:15654: recipe for target 'test-suite.log' failed
make[4]: *** [test-suite.log] Error 1
make[4]: Leaving directory '/home/ubuntu/src/src'
Makefile:15760: recipe for target 'check-TESTS' failed
make[3]: *** [check-TESTS] Error 2
make[3]: *** Waiting for unfinished jobs....
make[3]: Leaving directory '/home/ubuntu/src/src'
Makefile:15859: recipe for target 'check-am' failed
make[2]: *** [check-am] Error 2
make[2]: Leaving directory '/home/ubuntu/src/src'
Makefile:15547: recipe for target 'check-recursive' failed
make[1]: *** [check-recursive] Error 1
make[1]: Leaving directory '/home/ubuntu/src/src'
Makefile:820: recipe for target 'check-recursive' failed
make: *** [check-recursive] Error 1

real    0m21.261s
user    0m24.205s
sys     0m4.244s
Build finished with exit code 2
#BUILD#71c2b75b-178f-4b0e-83cb-815bbf1522c0#: 2