« part of build 2777  

Details for job 6ea3e6de-0f81-40b6-ac3e-30fdd9b9b931

failed

Name Linux x86_64 - system libs, fuzz
Success failed
Build Time 00:02:25
Git Head 7055c6d7ba57bea4e579eef0a7827ee80a64ad62
PR 19753
Worker # 2
Base Image ubuntu1804_full_base

Pull request info

Pull# 19753
Title
Head
Mergable
Changes
Comments
User

Tasks time consumption

00:00:27 - GIT_CHECKOUT
00:00:33 - APT_INSTALL
00:00:00 - RESTORE_CACHE
00:00:25 - CONFIGURE

Build log tail

        CXX      test/fuzz/test_fuzz_block_deserialize-deserialize.o
make[3]: Leaving directory '/home/ubuntu/src/src/univalue'
  CXX      test/fuzz/test_fuzz_block_file_info_deserialize-deserialize.o
  CXX      test/fuzz/test_fuzz_block_filter_deserialize-deserialize.o
  CXX      test/fuzz/test_fuzz_block_header-block_header.o
  CXX      test/fuzz/test_fuzz_block_header_and_short_txids_deserialize-deserialize.o
  CXX      test/fuzz/test_fuzz_blockfilter-blockfilter.o
  CXX      test/fuzz/test_fuzz_blockheader_deserialize-deserialize.o
  CXX      test/fuzz/test_fuzz_blocklocator_deserialize-deserialize.o
  CXX      test/fuzz/test_fuzz_blockmerkleroot-deserialize.o
  CXX      test/fuzz/test_fuzz_blocktransactions_deserialize-deserialize.o
  CXX      test/fuzz/test_fuzz_blocktransactionsrequest_deserialize-deserialize.o
  CXX      test/fuzz/test_fuzz_blockundo_deserialize-deserialize.o
  CXX      test/fuzz/test_fuzz_bloom_filter-bloom_filter.o
  CXX      test/fuzz/test_fuzz_bloomfilter_deserialize-deserialize.o
  CXX      test/fuzz/test_fuzz_buffered_file-buffered_file.o
  CXX      test/fuzz/test_fuzz_chain-chain.o
  CXX      test/fuzz/test_fuzz_checkqueue-checkqueue.o
  CXX      test/fuzz/test_fuzz_coins_deserialize-deserialize.o
  CXX      test/fuzz/test_fuzz_coins_view-coins_view.o
  CXX      test/fuzz/test_fuzz_crypto-crypto.o
  CXX      test/fuzz/test_fuzz_crypto_aes256-crypto_aes256.o
net_processing.cpp:3000:74: error: expected ')'
        if (AlreadyHaveTx(GenTxid(/* is_wtxid=*/true, wtxid), m_mempool) {
                                                                         ^
net_processing.cpp:3000:12: note: to match this '('
        if (AlreadyHaveTx(GenTxid(/* is_wtxid=*/true, wtxid), m_mempool) {
           ^
net_processing.cpp:3018:43: error: use of undeclared identifier 'state'
        if (AcceptToMemoryPool(m_mempool, state, ptx, &lRemovedTxn, false /* bypass_limits */, 0 /* nAbsurdFee */)) {
                                          ^
net_processing.cpp:3040:18: error: use of undeclared identifier 'state'; did you mean 'State'?
        else if (state.GetResult() == TxValidationResult::TX_MISSING_INPUTS)
                 ^~~~~
                 State
net_processing.cpp:463:20: note: 'State' declared here
static CNodeState *State(NodeId pnode) EXCLUSIVE_LOCKS_REQUIRED(cs_main) {
                   ^
net_processing.cpp:3040:23: error: member reference base type '(anonymous namespace)::CNodeState *(NodeId)' (aka '(anonymous namespace)::CNodeState *(long)') is not a structure or union
        else if (state.GetResult() == TxValidationResult::TX_MISSING_INPUTS)
                 ~~~~~^~~~~~~~~~
net_processing.cpp:3093:17: error: use of undeclared identifier 'state'; did you mean 'State'?
            if (state.GetResult() != TxValidationResult::TX_WITNESS_STRIPPED) {
                ^~~~~
                State
net_processing.cpp:463:20: note: 'State' declared here
static CNodeState *State(NodeId pnode) EXCLUSIVE_LOCKS_REQUIRED(cs_main) {
                   ^
net_processing.cpp:3093:22: error: member reference base type '(anonymous namespace)::CNodeState *(NodeId)' (aka '(anonymous namespace)::CNodeState *(long)') is not a structure or union
            if (state.GetResult() != TxValidationResult::TX_WITNESS_STRIPPED) {
                ~~~~~^~~~~~~~~~
net_processing.cpp:3117:21: error: use of undeclared identifier 'state'; did you mean 'State'?
                if (state.GetResult() == TxValidationResult::TX_INPUTS_NOT_STANDARD && tx.GetWitnessHash() != tx.GetHash()) {
                    ^~~~~
                    State
net_processing.cpp:463:20: note: 'State' declared here
static CNodeState *State(NodeId pnode) EXCLUSIVE_LOCKS_REQUIRED(cs_main) {
                   ^
net_processing.cpp:3117:26: error: member reference base type '(anonymous namespace)::CNodeState *(NodeId)' (aka '(anonymous namespace)::CNodeState *(long)') is not a structure or union
                if (state.GetResult() == TxValidationResult::TX_INPUTS_NOT_STANDARD && tx.GetWitnessHash() != tx.GetHash()) {
                    ~~~~~^~~~~~~~~~
net_processing.cpp:3146:13: error: use of undeclared identifier 'state'; did you mean 'State'?
        if (state.IsInvalid()) {
            ^~~~~
            State
net_processing.cpp:463:20: note: 'State' declared here
static CNodeState *State(NodeId pnode) EXCLUSIVE_LOCKS_REQUIRED(cs_main) {
                   ^
net_processing.cpp:3146:18: error: member reference base type '(anonymous namespace)::CNodeState *(NodeId)' (aka '(anonymous namespace)::CNodeState *(long)') is not a structure or union
        if (state.IsInvalid()) {
            ~~~~~^~~~~~~~~~
net_processing.cpp:3149:17: error: use of undeclared identifier 'state'
                state.ToString());
                ^
net_processing.cpp:3150:49: error: use of undeclared identifier 'state'
            MaybePunishNodeForTx(pfrom.GetId(), state);
                                                ^
12 errors generated.
  CXX      test/fuzz/test_fuzz_crypto_aes256cbc-crypto_aes256cbc.o
Makefile:11121: recipe for target 'libbitcoin_server_a-net_processing.o' failed
make[2]: *** [libbitcoin_server_a-net_processing.o] Error 1
make[2]: *** Waiting for unfinished jobs....
gcc -Wall -Wextra -Wno-unused-function -g -O2  gen_context.o -o gen_context
./gen_context
  CC       src/libsecp256k1_la-secp256k1.lo
  CCLD     libsecp256k1.la
/usr/bin/ar: `u' modifier ignored since `D' is the default (see `U')
make[3]: Leaving directory '/home/ubuntu/src/src/secp256k1'
make[2]: Leaving directory '/home/ubuntu/src/src'
Makefile:18343: recipe for target 'install-recursive' failed
make[1]: *** [install-recursive] Error 1
make[1]: Leaving directory '/home/ubuntu/src/src'
Makefile:798: recipe for target 'install-recursive' failed
make: *** [install-recursive] Error 1

real    0m5.446s
user    0m10.414s
sys     0m1.311s
Build finished with exit code 2
#BUILD#6ea3e6de-0f81-40b6-ac3e-30fdd9b9b931#: 2