« part of build 3797  

Details for job 4e4df81f-ac4c-4338-be8c-11ab6d9c8498

failed

Name Win64
Success failed
Build Time 00:14:08
Git Head 728c4bfc7f7eea29413b0564b49221ffb7961aa5
PR 17385
Worker # 3
Base Image ubuntu1804_full_base

Pull request info

Pull# 17385
Title
Head
Mergable
Changes
Comments
User

Tasks time consumption

00:00:16 - GIT_CHECKOUT
00:07:26 - APT_INSTALL
00:00:01 - RESTORE_CACHE
00:00:02 - MAKE_DEPENDS
00:00:01 - UPDATE_DEPENDENCY_CACHE
00:00:36 - CONFIGURE
00:04:48 - COMPILE_AND_INSTALL
00:00:05 - UPDATE_CCACHE_CACHE

Build log tail

      test/util_tests.cpp(66): Leaving test case "util_ParseHex"; testing time: 2566us

test/util_tests.cpp(87): Entering test case "util_HexStr"

test/util_tests.cpp(87): Leaving test case "util_HexStr"; testing time: 3093us

test/util_tests.cpp(134): Entering test case "util_Join"

test/util_tests.cpp(134): Leaving test case "util_Join"; testing time: 2153us

test/util_tests.cpp(148): Entering test case "util_FormatParseISO8601DateTime"

test/util_tests.cpp(148): Leaving test case "util_FormatParseISO8601DateTime"; testing time: 2359us

test/util_tests.cpp(161): Entering test case "util_FormatISO8601Date"

test/util_tests.cpp(161): Leaving test case "util_FormatISO8601Date"; testing time: 1729us

test/util_tests.cpp(198): Entering test case "util_ParseParameters"

test/util_tests.cpp(198): Leaving test case "util_ParseParameters"; testing time: 2035us

test/util_tests.cpp(234): Entering test case "util_GetBoolArg"

test/util_tests.cpp(234): Leaving test case "util_GetBoolArg"; testing time: 2191us

test/util_tests.cpp(274): Entering test case "util_GetBoolArgEdgeCases"

test/util_tests.cpp(274): Leaving test case "util_GetBoolArgEdgeCases"; testing time: 2224us

test/util_tests.cpp(327): Entering test case "util_ReadConfigStream"

test/util_tests.cpp(327): Leaving test case "util_ReadConfigStream"; testing time: 1903us

test/util_tests.cpp(519): Entering test case "util_GetArg"

test/util_tests.cpp(519): Leaving test case "util_GetArg"; testing time: 1851us

test/util_tests.cpp(557): Entering test case "util_GetChainName"

test/util_tests.cpp(557): Leaving test case "util_GetChainName"; testing time: 2006us

test/util_tests.cpp(716): Entering test case "util_ArgsMerge"

test/util_tests.cpp(716): Leaving test case "util_ArgsMerge"; testing time: 1129339us

test/util_tests.cpp(851): Entering test case "util_ChainMerge"

test/util_tests.cpp(931): error: in "util_tests/util_ChainMerge": check out_sha_hex == "94b4ad55c8ac639a56b93e36f7e32e4c611fd7d7dd7b2be6a71707b1eadcaec7" has failed [f3111858cb6e94e9438018d861e9d364f11d2745cbb75bd105a52872133b3d2e != 94b4ad55c8ac639a56b93e36f7e32e4c611fd7d7dd7b2be6a71707b1eadcaec7]

test/util_tests.cpp(851): Leaving test case "util_ChainMerge"; testing time: 21163us

test/util_tests.cpp(934): Entering test case "util_FormatMoney"

test/util_tests.cpp(934): Leaving test case "util_FormatMoney"; testing time: 4329us

test/util_tests.cpp(959): Entering test case "util_ParseMoney"

test/util_tests.cpp(959): Leaving test case "util_ParseMoney"; testing time: 3743us

test/util_tests.cpp(1012): Entering test case "util_IsHex"

test/util_tests.cpp(1012): Leaving test case "util_IsHex"; testing time: 3707us

test/util_tests.cpp(1027): Entering test case "util_IsHexNumber"

test/util_tests.cpp(1027): Leaving test case "util_IsHexNumber"; testing time: 3916us

test/util_tests.cpp(1052): Entering test case "util_seed_insecure_rand"

test/util_tests.cpp(1052): Leaving test case "util_seed_insecure_rand"; testing time: 4990us

test/util_tests.cpp(1077): Entering test case "util_TimingResistantEqual"

test/util_tests.cpp(1077): Leaving test case "util_TimingResistantEqual"; testing time: 4811us

test/util_tests.cpp(1092): Entering test case "strprintf_numbers"

test/util_tests.cpp(1092): Leaving test case "strprintf_numbers"; testing time: 3801us

test/util_tests.cpp(1118): Entering test case "gettime"

test/util_tests.cpp(1118): Leaving test case "gettime"; testing time: 3286us

test/util_tests.cpp(1123): Entering test case "util_time_GetTime"

test/util_tests.cpp(1123): Leaving test case "util_time_GetTime"; testing time: 5488us

test/util_tests.cpp(1144): Entering test case "test_IsDigit"

test/util_tests.cpp(1144): Leaving test case "test_IsDigit"; testing time: 3021us

test/util_tests.cpp(1159): Entering test case "test_ParseInt32"

test/util_tests.cpp(1159): Leaving test case "test_ParseInt32"; testing time: 3473us

test/util_tests.cpp(1188): Entering test case "test_ParseInt64"

test/util_tests.cpp(1188): Leaving test case "test_ParseInt64"; testing time: 3658us

test/util_tests.cpp(1218): Entering test case "test_ParseUInt32"

test/util_tests.cpp(1218): Leaving test case "test_ParseUInt32"; testing time: 3328us

test/util_tests.cpp(1249): Entering test case "test_ParseUInt64"

test/util_tests.cpp(1249): Leaving test case "test_ParseUInt64"; testing time: 3165us

test/util_tests.cpp(1281): Entering test case "test_ParseDouble"

test/util_tests.cpp(1281): Leaving test case "test_ParseDouble"; testing time: 8196us

test/util_tests.cpp(1309): Entering test case "test_FormatParagraph"

test/util_tests.cpp(1309): Leaving test case "test_FormatParagraph"; testing time: 2141us

test/util_tests.cpp(1336): Entering test case "test_FormatSubVersion"

test/util_tests.cpp(1336): Leaving test case "test_FormatSubVersion"; testing time: 2145us

test/util_tests.cpp(1348): Entering test case "test_ParseFixedPoint"

test/util_tests.cpp(1348): Leaving test case "test_ParseFixedPoint"; testing time: 2443us

test/util_tests.cpp(1451): Entering test case "test_LockDirectory"

test/util_tests.cpp(1451): Leaving test case "test_LockDirectory"; testing time: 21003us

test/util_tests.cpp(1539): Entering test case "test_DirIsWritable"

test/util_tests.cpp(1539): Leaving test case "test_DirIsWritable"; testing time: 21858us

test/util_tests.cpp(1555): Entering test case "test_ToLower"

test/util_tests.cpp(1555): Leaving test case "test_ToLower"; testing time: 8186us

test/util_tests.cpp(1569): Entering test case "test_ToUpper"

test/util_tests.cpp(1569): Leaving test case "test_ToUpper"; testing time: 2427us

test/util_tests.cpp(1583): Entering test case "test_Capitalize"

test/util_tests.cpp(1583): Leaving test case "test_Capitalize"; testing time: 2693us

test/util_tests.cpp(1595): Entering test case "test_spanparsing"

test/util_tests.cpp(1595): Leaving test case "test_spanparsing"; testing time: 2839us

test/util_tests.cpp(1713): Entering test case "test_LogEscapeMessage"

test/util_tests.cpp(1713): Leaving test case "test_LogEscapeMessage"; testing time: 7074us

test/util_tests.cpp(1754): Entering test case "test_tracked_vector"

test/util_tests.cpp(1754): Leaving test case "test_tracked_vector"; testing time: 3389us

test/util_tests.cpp(35): Leaving test suite "util_tests"; testing time: 1339037us

Leaving test module "Bitcoin Core Test Suite"; testing time: 1339592us



*** 1 failure is detected in the test module "Bitcoin Core Test Suite"

Makefile:14928: recipe for target 'test/util_tests.cpp.test' failed
make[3]: *** [test/util_tests.cpp.test] Error 1
make[3]: *** Waiting for unfinished jobs....
make[3]: Leaving directory '/home/ubuntu/src/src'
Makefile:14666: recipe for target 'check-am' failed
make[2]: *** [check-am] Error 2
make[2]: Leaving directory '/home/ubuntu/src/src'
Makefile:14354: recipe for target 'check-recursive' failed
make[1]: *** [check-recursive] Error 1
make[1]: Leaving directory '/home/ubuntu/src/src'
Makefile:775: recipe for target 'check-recursive' failed
make: *** [check-recursive] Error 1

real    0m13.820s
user    0m26.693s
sys     0m4.350s
Build finished with exit code 2
#BUILD#4e4df81f-ac4c-4338-be8c-11ab6d9c8498#: 2