« part of build 2777  

Details for job 469cd56c-3786-4238-85e7-42195091f8a3

failed

Name Linux x86_64 - system libs, clang
Success failed
Build Time 00:02:29
Git Head 7055c6d7ba57bea4e579eef0a7827ee80a64ad62
PR 19753
Worker # 4
Base Image ubuntu1804_full_base

Pull request info

Pull# 19753
Title
Head
Mergable
Changes
Comments
User

Tasks time consumption

00:00:21 - GIT_CHECKOUT
00:00:53 - APT_INSTALL
00:00:00 - RESTORE_CACHE
00:00:23 - CONFIGURE

Build log tail

        CXX      rpc/libbitcoin_util_a-request.o
  CXX      support/libbitcoin_util_a-cleanse.o
  CXX      libbitcoin_util_a-sync.o
  CXX      libbitcoin_util_a-threadinterrupt.o
  CXX      util/libbitcoin_util_a-asmap.o
  CXX      util/libbitcoin_util_a-bip32.o
  CXX      util/libbitcoin_util_a-bytevectorhash.o
  CXX      util/libbitcoin_util_a-error.o
  CXX      util/libbitcoin_util_a-fees.o
  CXX      util/libbitcoin_util_a-system.o
  CXX      util/libbitcoin_util_a-message.o
  CXX      util/libbitcoin_util_a-moneystr.o
  CXX      util/libbitcoin_util_a-rbf.o
  CXX      util/libbitcoin_util_a-settings.o
  CXX      util/libbitcoin_util_a-threadnames.o
  CXX      util/libbitcoin_util_a-spanparsing.o
  CXX      util/libbitcoin_util_a-strencodings.o
  CXX      util/libbitcoin_util_a-string.o
  CXX      util/libbitcoin_util_a-time.o
  CXX      util/libbitcoin_util_a-url.o
make[3]: Entering directory '/home/ubuntu/src/src/univalue'
  CXX      lib/libunivalue_la-univalue.lo
  CXX      libbitcoin_consensus_a-arith_uint256.o
  CXX      lib/libunivalue_la-univalue_get.lo
net_processing.cpp:3000:74: error: expected ')'
        if (AlreadyHaveTx(GenTxid(/* is_wtxid=*/true, wtxid), m_mempool) {
                                                                         ^
net_processing.cpp:3000:12: note: to match this '('
        if (AlreadyHaveTx(GenTxid(/* is_wtxid=*/true, wtxid), m_mempool) {
           ^
net_processing.cpp:3018:43: error: use of undeclared identifier 'state'
        if (AcceptToMemoryPool(m_mempool, state, ptx, &lRemovedTxn, false /* bypass_limits */, 0 /* nAbsurdFee */)) {
                                          ^
net_processing.cpp:3040:18: error: use of undeclared identifier 'state'; did you mean 'State'?
        else if (state.GetResult() == TxValidationResult::TX_MISSING_INPUTS)
                 ^~~~~
                 State
net_processing.cpp:463:20: note: 'State' declared here
static CNodeState *State(NodeId pnode) EXCLUSIVE_LOCKS_REQUIRED(cs_main) {
                   ^
net_processing.cpp:3040:23: error: member reference base type '(anonymous namespace)::CNodeState *(NodeId)' (aka '(anonymous namespace)::CNodeState *(long)') is not a structure or union
        else if (state.GetResult() == TxValidationResult::TX_MISSING_INPUTS)
                 ~~~~~^~~~~~~~~~
net_processing.cpp:3093:17: error: use of undeclared identifier 'state'; did you mean 'State'?
            if (state.GetResult() != TxValidationResult::TX_WITNESS_STRIPPED) {
                ^~~~~
                State
net_processing.cpp:463:20: note: 'State' declared here
static CNodeState *State(NodeId pnode) EXCLUSIVE_LOCKS_REQUIRED(cs_main) {
                   ^
net_processing.cpp:3093:22: error: member reference base type '(anonymous namespace)::CNodeState *(NodeId)' (aka '(anonymous namespace)::CNodeState *(long)') is not a structure or union
            if (state.GetResult() != TxValidationResult::TX_WITNESS_STRIPPED) {
                ~~~~~^~~~~~~~~~
net_processing.cpp:3117:21: error: use of undeclared identifier 'state'; did you mean 'State'?
                if (state.GetResult() == TxValidationResult::TX_INPUTS_NOT_STANDARD && tx.GetWitnessHash() != tx.GetHash()) {
                    ^~~~~
                    State
net_processing.cpp:463:20: note: 'State' declared here
static CNodeState *State(NodeId pnode) EXCLUSIVE_LOCKS_REQUIRED(cs_main) {
                   ^
net_processing.cpp:3117:26: error: member reference base type '(anonymous namespace)::CNodeState *(NodeId)' (aka '(anonymous namespace)::CNodeState *(long)') is not a structure or union
                if (state.GetResult() == TxValidationResult::TX_INPUTS_NOT_STANDARD && tx.GetWitnessHash() != tx.GetHash()) {
                    ~~~~~^~~~~~~~~~
net_processing.cpp:3146:13: error: use of undeclared identifier 'state'; did you mean 'State'?
        if (state.IsInvalid()) {
            ^~~~~
            State
net_processing.cpp:463:20: note: 'State' declared here
static CNodeState *State(NodeId pnode) EXCLUSIVE_LOCKS_REQUIRED(cs_main) {
                   ^
net_processing.cpp:3146:18: error: member reference base type '(anonymous namespace)::CNodeState *(NodeId)' (aka '(anonymous namespace)::CNodeState *(long)') is not a structure or union
        if (state.IsInvalid()) {
            ~~~~~^~~~~~~~~~
net_processing.cpp:3149:17: error: use of undeclared identifier 'state'
                state.ToString());
                ^
net_processing.cpp:3150:49: error: use of undeclared identifier 'state'
            MaybePunishNodeForTx(pfrom.GetId(), state);
                                                ^
12 errors generated.
Makefile:11121: recipe for target 'libbitcoin_server_a-net_processing.o' failed
make[2]: *** [libbitcoin_server_a-net_processing.o] Error 1
make[2]: *** Waiting for unfinished jobs....
  CXX      lib/libunivalue_la-univalue_read.lo
  CXX      lib/libunivalue_la-univalue_write.lo
  CXXLD    libunivalue.la
ar: `u' modifier ignored since `D' is the default (see `U')
make[3]: Leaving directory '/home/ubuntu/src/src/univalue'
make[2]: Leaving directory '/home/ubuntu/src/src'
Makefile:18343: recipe for target 'install-recursive' failed
make[1]: *** [install-recursive] Error 1
make[1]: Leaving directory '/home/ubuntu/src/src'
Makefile:798: recipe for target 'install-recursive' failed
make: *** [install-recursive] Error 1

real    0m6.784s
user    0m14.269s
sys     0m1.944s
Build finished with exit code 2
#BUILD#469cd56c-3786-4238-85e7-42195091f8a3#: 2