« part of build 15487  

Details for job 461cbea9-ff78-47e6-8cb1-16a8cd520fa2

failed

Name Linux x86_64 - system libs, fuzz
Success failed
Build Time 00:03:31
Git Head 600efe49b82a734d218b366d42dabcd7f7d989dd
PR 23432
Worker # 3
Base Image ubuntu1804_full_base

Pull request info

Pull# 23432
Title
Head
Mergable
Changes
Comments
User

Tasks time consumption

00:00:16 - GIT_CHECKOUT
00:00:19 - APT_INSTALL
00:00:00 - RESTORE_CACHE
00:00:14 - CONFIGURE

Build log tail

        with wallet     = no
  with gui / qt   = no
  with zmq        = no
  with test       = not building test_bitcoin because fuzzing is enabled
    with fuzz     = yes
  with bench      = no
  with upnp       = no
  with natpmp     = no
  use asm         = yes
  ebpf tracing    = no
  sanitizers      = fuzzer,address,undefined
  debug enabled   = no
  gprof enabled   = no
  werror          = no

  target os       = linux
  build os        = linux-gnu

  CC              = /usr/bin/ccache clang-8
  CFLAGS          = -pthread -g -O2
  CPPFLAGS        =  -DABORT_ON_FAILED_ASSUME  -U_FORTIFY_SOURCE -D_FORTIFY_SOURCE=2  -DHAVE_BUILD_INFO -D__STDC_FORMAT_MACROS
  CXX             = /usr/bin/ccache clang++-8 -std=c++17
  CXXFLAGS        =  -fdebug-prefix-map=$(abs_top_srcdir)=.  -Wstack-protector -fstack-protector-all -fcf-protection=full  -Wall -Wextra -Wgnu -Wformat -Wformat-security -Wvla -Wshadow-field -Wthread-safety -Wloop-analysis -Wredundant-decls -Wunused-member-function -Wdate-time -Wconditional-uninitialized -Woverloaded-virtual -Wunreachable-code-loop-increment -Wimplicit-fallthrough -Wdocumentation  -Wno-unused-parameter -Wno-self-assign   -g -O2
  LDFLAGS         = -lpthread  -Wl,-z,relro -Wl,-z,now -Wl,-z,separate-code -pie  
  ARFLAGS         = cr


real    0m13.811s
user    0m10.073s
sys     0m3.348s
+ timeblock_end CONFIGURE
++ date +%s
+ echo -e '\n###END#CONFIGURE#1637861461\n\n\n'

###END#CONFIGURE#1637861461



+ timeblock_start COMPILE_AND_INSTALL
++ date +%s
+ echo -e '\n###START#COMPILE_AND_INSTALL#1637861461\n'

###START#COMPILE_AND_INSTALL#1637861461

+ make install -j4
Making install in src
make[1]: Entering directory '/home/ubuntu/src/src'
make[2]: Entering directory '/home/ubuntu/src/src'
  CXX      libbitcoin_server_a-addrdb.o
  CXX      libbitcoin_server_a-addrman.o
  CXX      libbitcoin_server_a-banman.o
  CXX      libbitcoin_server_a-blockencodings.o
In file included from addrman.cpp:6:
In file included from ./addrman.h:9:
In file included from ./netaddress.h:19:
./util/strencodings.h:16:10: fatal error: 'charconv' file not found
#include <charconv>
         ^~~~~~~~~~
In file included from addrdb.cpp:8:
In file included from ./addrman.h:9:
In file included from ./netaddress.h:19:
./util/strencodings.h:16:10: fatal error: 'charconv' file not found
#include <charconv>
         ^~~~~~~~~~
In file included from blockencodings.cpp:8:
In file included from ./chainparams.h:11:
In file included from ./netaddress.h:19:
./util/strencodings.h:16:10: fatal error: 'charconv' file not found
#include <charconv>
         ^~~~~~~~~~
1 error generated.
Makefile:8329: recipe for target 'libbitcoin_server_a-addrdb.o' failed
make[2]: *** [libbitcoin_server_a-addrdb.o] Error 1
make[2]: *** Waiting for unfinished jobs....
1 error generated.
Makefile:8343: recipe for target 'libbitcoin_server_a-addrman.o' failed
make[2]: *** [libbitcoin_server_a-addrman.o] Error 1
In file included from banman.cpp:8:
In file included from ./netaddress.h:19:
./util/strencodings.h:16:10: fatal error: 'charconv' file not found
#include <charconv>
         ^~~~~~~~~~
1 error generated.
Makefile:8357: recipe for target 'libbitcoin_server_a-banman.o' failed
make[2]: *** [libbitcoin_server_a-banman.o] Error 1
1 error generated.
Makefile:8371: recipe for target 'libbitcoin_server_a-blockencodings.o' failed
make[2]: *** [libbitcoin_server_a-blockencodings.o] Error 1
make[2]: Leaving directory '/home/ubuntu/src/src'
Makefile:15884: recipe for target 'install-recursive' failed
make[1]: *** [install-recursive] Error 1
make[1]: Leaving directory '/home/ubuntu/src/src'
Makefile:813: recipe for target 'install-recursive' failed
make: *** [install-recursive] Error 1

real    0m1.447s
user    0m3.086s
sys     0m0.292s
Build finished with exit code 2
#BUILD#461cbea9-ff78-47e6-8cb1-16a8cd520fa2#: 2