« part of build 15478  

Details for job 43acb68c-46f3-407f-bd88-70f2941c5aec

failed

Name Linux x86_64 - system libs, clang
Success failed
Build Time 00:02:04
Git Head 46cf7877e40499dab4416fb3c9f5b72ede6c5f69
PR 22506
Worker # 2
Base Image ubuntu1804_full_base

Pull request info

Pull# 22506
Title
Head
Mergable
Changes
Comments
User

Tasks time consumption

00:00:16 - GIT_CHECKOUT
00:00:34 - APT_INSTALL
00:00:00 - RESTORE_CACHE
00:00:26 - CONFIGURE

Build log tail

        module extrakeys        = yes
  module schnorrsig       = yes

  asm                     = x86_64
  ecmult window size      = 15
  ecmult gen prec. bits   = 4

  valgrind                = no
  CC                      = clang-10
  CPPFLAGS                =  -DDEBUG_LOCKORDER
  SECP_CFLAGS             = -O2  -std=c89 -pedantic -Wno-long-long -Wnested-externs -Wshadow -Wstrict-prototypes -Wundef -Wno-overlength-strings -Wall -Wno-unused-function -Wextra -Wcast-align -Wconditional-uninitialized -fvisibility=hidden 
  CFLAGS                  = -g -O2
  LDFLAGS                 = 

  CC_FOR_BUILD            = clang-10
  CPPFLAGS_FOR_BUILD      =  -DDEBUG_LOCKORDER
  SECP_CFLAGS_FOR_BUILD   = -O2  -std=c89 -pedantic -Wno-long-long -Wnested-externs -Wshadow -Wstrict-prototypes -Wundef -Wno-overlength-strings -Wall -Wno-unused-function -Wextra -Wcast-align -Wconditional-uninitialized -fvisibility=hidden 
  CFLAGS_FOR_BUILD        = -g -O2
  LDFLAGS_FOR_BUILD       = 

Options used to compile and link:
  external signer = yes
  multiprocess    = no
  with experimental syscall sandbox support = no
  with libs       = yes
  with wallet     = yes
    with sqlite   = yes
    with bdb      = yes
  with gui / qt   = yes
    with qr       = yes
  with zmq        = yes
  with test       = yes
  with bench      = yes
  with upnp       = yes
  with natpmp     = no
  use asm         = yes
  ebpf tracing    = no
  sanitizers      = address,integer,undefined
  debug enabled   = no
  gprof enabled   = no
  werror          = no
  LTO             = no

  target os       = linux
  build os        = linux-gnu

  CC              = /usr/bin/ccache clang-10
  CFLAGS          = -pthread -g -O2
  CPPFLAGS        =  -fmacro-prefix-map=$(abs_top_srcdir)=.  -U_FORTIFY_SOURCE -D_FORTIFY_SOURCE=2 -DDEBUG_LOCKORDER -DHAVE_BUILD_INFO -DPROVIDE_FUZZ_MAIN_FUNCTION
  CXX             = /usr/bin/ccache clang++-10 -std=c++17
  CXXFLAGS        =   -fdebug-prefix-map=$(abs_top_srcdir)=.  -Wstack-protector -fstack-protector-all -fcf-protection=full  -Wall -Wextra -Wgnu -Wformat -Wformat-security -Wvla -Wshadow-field -Wthread-safety -Wrange-loop-analysis -Wredundant-decls -Wunused-member-function -Wdate-time -Wconditional-uninitialized -Woverloaded-virtual -Wunreachable-code-loop-increment -Wimplicit-fallthrough -Wdocumentation  -Wno-unused-parameter -Wno-self-assign   -g -O2
  LDFLAGS         =  -lpthread  -Wl,-z,relro -Wl,-z,now -Wl,-z,separate-code -pie  
  ARFLAGS         = cr


real    0m25.943s
user    0m20.392s
sys     0m6.413s
+ timeblock_end CONFIGURE
++ date +%s
+ echo -e '\n###END#CONFIGURE#1637844619\n\n\n'

###END#CONFIGURE#1637844619



+ timeblock_start COMPILE_AND_INSTALL
++ date +%s
+ echo -e '\n###START#COMPILE_AND_INSTALL#1637844619\n'

###START#COMPILE_AND_INSTALL#1637844619

+ make install -j4
Making install in src
make[1]: Entering directory '/home/ubuntu/src/src'
make[2]: Entering directory '/home/ubuntu/src/src'
  CXX      libbitcoinconsensus_la-arith_uint256.lo
  CXX      libbitcoinconsensus_la-hash.lo
  CXX      libbitcoinconsensus_la-pubkey.lo
  CXX      libbitcoinconsensus_la-uint256.lo
In file included from uint256.cpp:8:
./util/strencodings.h:16:10: fatal error: 'charconv' file not found
#include <charconv>
         ^~~~~~~~~~
1 error generated.
Makefile:12530: recipe for target 'libbitcoinconsensus_la-uint256.lo' failed
make[2]: *** [libbitcoinconsensus_la-uint256.lo] Error 1
make[2]: *** Waiting for unfinished jobs....
make[2]: Leaving directory '/home/ubuntu/src/src'
Makefile:16481: recipe for target 'install-recursive' failed
make[1]: *** [install-recursive] Error 1
make[1]: Leaving directory '/home/ubuntu/src/src'
Makefile:817: recipe for target 'install-recursive' failed
make: *** [install-recursive] Error 1

real    0m3.687s
user    0m7.624s
sys     0m0.465s
Build finished with exit code 2
#BUILD#43acb68c-46f3-407f-bd88-70f2941c5aec#: 2