« part of build 289  

Details for job 33e826b7-2c37-487c-b08b-4642e2a03aba

failed

Name Win64
Success failed
Build Time 00:02:42
Git Head 0aa6f27306a6afdd4cd985636730ff41d9b99ced
PR 17595
Worker # 2
Base Image ubuntu1804_full_base

Pull request info

Pull# 17595
Title
Head
Mergable
Changes
Comments
User

Tasks time consumption

00:00:13 - GIT_CHECKOUT
00:00:00 - APT_INSTALL
00:00:01 - RESTORE_CACHE
00:00:01 - MAKE_DEPENDS
00:00:00 - UPDATE_DEPENDENCY_CACHE
00:00:24 - CONFIGURE
00:00:37 - COMPILE_AND_INSTALL
00:00:01 - UPDATE_CCACHE_CACHE

Build log tail

      Running tests: transaction_tests from test/transaction_tests.cpp
Running tests: txindex_tests from test/txindex_tests.cpp
Running tests: txvalidation_tests from test/txvalidation_tests.cpp
Running tests: txvalidationcache_tests from test/txvalidationcache_tests.cpp
Running tests: uint256_tests from test/uint256_tests.cpp
Running tests: util_tests from test/util_tests.cpp
Running tests: validation_block_tests from test/validation_block_tests.cpp
Running tests: validation_flush_tests from test/validation_flush_tests.cpp
Running tests: versionbits_tests from test/versionbits_tests.cpp
Running tests: db_tests from wallet/test/db_tests.cpp
Running tests: psbt_wallet_tests from wallet/test/psbt_wallet_tests.cpp
Running tests: wallet_tests from wallet/test/wallet_tests.cpp
Running tests: wallet_crypto_tests from wallet/test/wallet_crypto_tests.cpp
Running tests: coinselector_tests from wallet/test/coinselector_tests.cpp
Running tests: init_tests from wallet/test/init_tests.cpp
Running tests: ismine_tests from wallet/test/ismine_tests.cpp
Running test/util/bitcoin-util-test.py...
/usr/bin/python3.6 ../test/util/bitcoin-util-test.py
Running test/util/rpcauth-test.py...
/usr/bin/python3.6 ../test/util/rpcauth-test.py
...
----------------------------------------------------------------------
Ran 3 tests in 0.003s

OK
make[4]: Entering directory '/home/ubuntu/src/src/secp256k1'
  CC       src/tests-tests.o
  CC       src/exhaustive_tests-tests_exhaustive.o
  CCLD     exhaustive_tests.exe
  CCLD     tests.exe
make  check-TESTS
make[5]: Entering directory '/home/ubuntu/src/src/secp256k1'
make[6]: Entering directory '/home/ubuntu/src/src/secp256k1'
FAIL: tests.exe
PASS: exhaustive_tests.exe
========================================
   libsecp256k1 0.1: ./test-suite.log
========================================

# TOTAL: 2
# PASS:  1
# SKIP:  0
# XFAIL: 0
# FAIL:  1
# XPASS: 0
# ERROR: 0

.. contents:: :depth: 2

FAIL: tests
===========

it looks like wine32 is missing, you should install it.
multiarch needs to be enabled first.  as root, please
execute "dpkg --add-architecture i386 && apt-get update &&
apt-get install wine32"
test count = 64

random seed = a1ebeeb7c704e07e7cdc5c427e9b433d

src/tests.c:450: test condition failed: ((~x[m][shift]) << (64 - (1 << usebits))) == 0

FAIL tests.exe (exit status: 3)

============================================================================
Testsuite summary for libsecp256k1 0.1
============================================================================
# TOTAL: 2
# PASS:  1
# SKIP:  0
# XFAIL: 0
# FAIL:  1
# XPASS: 0
# ERROR: 0
============================================================================
See ./test-suite.log
============================================================================
Makefile:1245: recipe for target 'test-suite.log' failed
make[6]: *** [test-suite.log] Error 1
make[6]: Leaving directory '/home/ubuntu/src/src/secp256k1'
Makefile:1351: recipe for target 'check-TESTS' failed
make[5]: *** [check-TESTS] Error 2
make[5]: Leaving directory '/home/ubuntu/src/src/secp256k1'
Makefile:1564: recipe for target 'check-am' failed
make[4]: *** [check-am] Error 2
make[4]: Leaving directory '/home/ubuntu/src/src/secp256k1'
Makefile:16088: recipe for target 'check-local' failed
make[3]: *** [check-local] Error 2
make[3]: Leaving directory '/home/ubuntu/src/src'
Makefile:15834: recipe for target 'check-am' failed
make[2]: *** [check-am] Error 2
make[2]: Leaving directory '/home/ubuntu/src/src'
Makefile:15522: recipe for target 'check-recursive' failed
make[1]: *** [check-recursive] Error 1
make[1]: Leaving directory '/home/ubuntu/src/src'
Makefile:790: recipe for target 'check-recursive' failed
make: *** [check-recursive] Error 1

real    0m38.638s
user    0m47.792s
sys     0m11.226s
Build finished with exit code 2
#BUILD#33e826b7-2c37-487c-b08b-4642e2a03aba#: 2