« part of build 11512  

Details for job 30423aaf-fde1-40d9-b8ad-5b8866a6f87d

failed

Name Linux x86_64 - system libs, clang
Success failed
Build Time 00:06:09
Git Head 12ca4486bc6237e92e2dcf1bad8dc6fc61cd3e8d
PR 22219
Worker # 6
Base Image ubuntu1804_full_base

Pull request info

Pull# 22219
Title
Head
Mergable
Changes
Comments
User

Tasks time consumption

00:00:12 - GIT_CHECKOUT
00:01:01 - APT_INSTALL
00:00:01 - RESTORE_CACHE
00:00:31 - CONFIGURE
00:03:17 - COMPILE_AND_INSTALL
00:00:09 - UPDATE_CCACHE_CACHE

Build log tail

      sys     0m0.238s
+ '[' -f /mnt/shared/cache/eb264a46d9b95159c773e46a0b6826cd_ccache_x86_64-unknown-linux-gnu-syslibs.tar ']'
+ mv /mnt/shared/cache/eb264a46d9b95159c773e46a0b6826cd_ccache_copy_x86_64-unknown-linux-gnu-syslibs.tar /mnt/shared/cache/eb264a46d9b95159c773e46a0b6826cd_ccache_x86_64-unknown-linux-gnu-syslibs.tar

real    0m0.024s
user    0m0.002s
sys     0m0.000s
+ timeblock_end UPDATE_CCACHE_CACHE
++ date +%s
+ echo -e '\n###END#UPDATE_CCACHE_CACHE#1623394800\n\n\n'

###END#UPDATE_CCACHE_CACHE#1623394800



+ '[' true = true ']'
+ timeblock_start RUN_UNIT_TESTS
++ date +%s
+ echo -e '\n###START#RUN_UNIT_TESTS#1623394800\n'

###START#RUN_UNIT_TESTS#1623394800

+ make -j4 check VERBOSE=1
Making check in src
make[1]: Entering directory '/home/ubuntu/src/src'
make[2]: Entering directory '/home/ubuntu/src/src'
make  check-TESTS check-local
make[3]: Entering directory '/home/ubuntu/src/src'
Running tests: amount_tests from test/amount_tests.cpp
Running tests: addrman_tests from test/addrman_tests.cpp
Running tests: arith_uint256_tests from test/arith_uint256_tests.cpp
make[4]: Entering directory '/home/ubuntu/src/src'
Running tests: allocator_tests from test/allocator_tests.cpp
Running tests: base32_tests from test/base32_tests.cpp
Running tests: base58_tests from test/base58_tests.cpp
Running tests: base64_tests from test/base64_tests.cpp
Running tests: bech32_tests from test/bech32_tests.cpp
Running tests: bip32_tests from test/bip32_tests.cpp
../build-aux/test-driver: line 107: 17631 Aborted                 (core dumped) "$@" > $log_file 2>&1
FAIL: qt/test/test_bitcoin-qt
Running tests: blockchain_tests from test/blockchain_tests.cpp
==============================================
   Bitcoin Core 21.99.0: src/test-suite.log
==============================================

# TOTAL: 1
# PASS:  0
# SKIP:  0
# XFAIL: 0
# FAIL:  1
# XPASS: 0
# ERROR: 0

.. contents:: :depth: 2

FAIL: qt/test/test_bitcoin-qt
=============================

********* Start testing of AppTests *********
Config: Using QtTest library 5.9.5, Qt 5.9.5 (x86_64-little_endian-lp64 shared (dynamic) release build; by GCC 7.4.0)
PASS   : AppTests::initTestCase()
QINFO  : AppTests::appTests() Backing up GUI settings to "/tmp/test_common_Bitcoin Core/a37ca963fddfbea2df7527089da35302110fab1743e021765bdb773e2cd1b452/regtest/guisettings.ini.bak"
test_bitcoin-qt: wallet/init.cpp:128: auto WalletInit::Construct(NodeContext &)::(anonymous class)::operator()() const: Assertion `"node.args" && check' failed.
FAIL qt/test/test_bitcoin-qt (exit status: 134)

============================================================================
Testsuite summary for Bitcoin Core 21.99.0
============================================================================
# TOTAL: 1
# PASS:  0
# SKIP:  0
# XFAIL: 0
# FAIL:  1
# XPASS: 0
# ERROR: 0
============================================================================
See src/test-suite.log
Please report to https://github.com/bitcoin/bitcoin/issues
============================================================================
Makefile:15654: recipe for target 'test-suite.log' failed
make[4]: *** [test-suite.log] Error 1
make[4]: Leaving directory '/home/ubuntu/src/src'
Makefile:15760: recipe for target 'check-TESTS' failed
make[3]: *** [check-TESTS] Error 2
make[3]: *** Waiting for unfinished jobs....
make[3]: Leaving directory '/home/ubuntu/src/src'
Makefile:15859: recipe for target 'check-am' failed
make[2]: *** [check-am] Error 2
make[2]: Leaving directory '/home/ubuntu/src/src'
Makefile:15547: recipe for target 'check-recursive' failed
make[1]: *** [check-recursive] Error 1
make[1]: Leaving directory '/home/ubuntu/src/src'
Makefile:820: recipe for target 'check-recursive' failed
make: *** [check-recursive] Error 1

real    0m4.626s
user    0m7.566s
sys     0m0.897s
Build finished with exit code 2
#BUILD#30423aaf-fde1-40d9-b8ad-5b8866a6f87d#: 2