« part of build 3797  

Details for job 2e2809d4-cc0b-42a6-9ab8-7808f93e20de

failed

Name Linux32
Success failed
Build Time 00:16:52
Git Head 728c4bfc7f7eea29413b0564b49221ffb7961aa5
PR 17385
Worker # 4
Base Image ubuntu1804_full_base

Pull request info

Pull# 17385
Title
Head
Mergable
Changes
Comments
User

Tasks time consumption

00:00:12 - GIT_CHECKOUT
00:10:06 - APT_INSTALL
00:00:00 - RESTORE_CACHE
00:00:02 - MAKE_DEPENDS
00:00:02 - UPDATE_DEPENDENCY_CACHE
00:00:22 - CONFIGURE
00:05:01 - COMPILE_AND_INSTALL
00:00:04 - UPDATE_CCACHE_CACHE

Build log tail

      test/util_tests.cpp(66): Leaving test case "util_ParseHex"; testing time: 1435us
test/util_tests.cpp(87): Entering test case "util_HexStr"
test/util_tests.cpp(87): Leaving test case "util_HexStr"; testing time: 1311us
test/util_tests.cpp(134): Entering test case "util_Join"
test/util_tests.cpp(134): Leaving test case "util_Join"; testing time: 1293us
test/util_tests.cpp(148): Entering test case "util_FormatParseISO8601DateTime"
test/util_tests.cpp(148): Leaving test case "util_FormatParseISO8601DateTime"; testing time: 1436us
test/util_tests.cpp(161): Entering test case "util_FormatISO8601Date"
test/util_tests.cpp(161): Leaving test case "util_FormatISO8601Date"; testing time: 1329us
test/util_tests.cpp(198): Entering test case "util_ParseParameters"
test/util_tests.cpp(198): Leaving test case "util_ParseParameters"; testing time: 1338us
test/util_tests.cpp(234): Entering test case "util_GetBoolArg"
test/util_tests.cpp(234): Leaving test case "util_GetBoolArg"; testing time: 1375us
test/util_tests.cpp(274): Entering test case "util_GetBoolArgEdgeCases"
test/util_tests.cpp(274): Leaving test case "util_GetBoolArgEdgeCases"; testing time: 1395us
test/util_tests.cpp(327): Entering test case "util_ReadConfigStream"
test/util_tests.cpp(327): Leaving test case "util_ReadConfigStream"; testing time: 1500us
test/util_tests.cpp(519): Entering test case "util_GetArg"
test/util_tests.cpp(519): Leaving test case "util_GetArg"; testing time: 1406us
test/util_tests.cpp(557): Entering test case "util_GetChainName"
test/util_tests.cpp(557): Leaving test case "util_GetChainName"; testing time: 1525us
test/util_tests.cpp(716): Entering test case "util_ArgsMerge"
test/util_tests.cpp(716): Leaving test case "util_ArgsMerge"; testing time: 1855224us
test/util_tests.cpp(851): Entering test case "util_ChainMerge"
test/util_tests.cpp(931): error: in "util_tests/util_ChainMerge": check out_sha_hex == "94b4ad55c8ac639a56b93e36f7e32e4c611fd7d7dd7b2be6a71707b1eadcaec7" has failed [f3111858cb6e94e9438018d861e9d364f11d2745cbb75bd105a52872133b3d2e != 94b4ad55c8ac639a56b93e36f7e32e4c611fd7d7dd7b2be6a71707b1eadcaec7]
test/util_tests.cpp(851): Leaving test case "util_ChainMerge"; testing time: 16258us
test/util_tests.cpp(934): Entering test case "util_FormatMoney"
test/util_tests.cpp(934): Leaving test case "util_FormatMoney"; testing time: 1487us
test/util_tests.cpp(959): Entering test case "util_ParseMoney"
test/util_tests.cpp(959): Leaving test case "util_ParseMoney"; testing time: 1509us
test/util_tests.cpp(1012): Entering test case "util_IsHex"
test/util_tests.cpp(1012): Leaving test case "util_IsHex"; testing time: 1452us
test/util_tests.cpp(1027): Entering test case "util_IsHexNumber"
test/util_tests.cpp(1027): Leaving test case "util_IsHexNumber"; testing time: 1456us
test/util_tests.cpp(1052): Entering test case "util_seed_insecure_rand"
test/util_tests.cpp(1052): Leaving test case "util_seed_insecure_rand"; testing time: 3261us
test/util_tests.cpp(1077): Entering test case "util_TimingResistantEqual"
test/util_tests.cpp(1077): Leaving test case "util_TimingResistantEqual"; testing time: 1482us
test/util_tests.cpp(1092): Entering test case "strprintf_numbers"
test/util_tests.cpp(1092): Leaving test case "strprintf_numbers"; testing time: 1412us
test/util_tests.cpp(1118): Entering test case "gettime"
test/util_tests.cpp(1118): Leaving test case "gettime"; testing time: 1614us
test/util_tests.cpp(1123): Entering test case "util_time_GetTime"
test/util_tests.cpp(1123): Leaving test case "util_time_GetTime"; testing time: 3849us
test/util_tests.cpp(1144): Entering test case "test_IsDigit"
test/util_tests.cpp(1144): Leaving test case "test_IsDigit"; testing time: 1521us
test/util_tests.cpp(1159): Entering test case "test_ParseInt32"
test/util_tests.cpp(1159): Leaving test case "test_ParseInt32"; testing time: 1368us
test/util_tests.cpp(1188): Entering test case "test_ParseInt64"
test/util_tests.cpp(1188): Leaving test case "test_ParseInt64"; testing time: 1415us
test/util_tests.cpp(1218): Entering test case "test_ParseUInt32"
test/util_tests.cpp(1218): Leaving test case "test_ParseUInt32"; testing time: 1486us
test/util_tests.cpp(1249): Entering test case "test_ParseUInt64"
test/util_tests.cpp(1249): Leaving test case "test_ParseUInt64"; testing time: 1472us
test/util_tests.cpp(1281): Entering test case "test_ParseDouble"
test/util_tests.cpp(1281): Leaving test case "test_ParseDouble"; testing time: 9572us
test/util_tests.cpp(1309): Entering test case "test_FormatParagraph"
test/util_tests.cpp(1309): Leaving test case "test_FormatParagraph"; testing time: 1488us
test/util_tests.cpp(1336): Entering test case "test_FormatSubVersion"
test/util_tests.cpp(1336): Leaving test case "test_FormatSubVersion"; testing time: 1520us
test/util_tests.cpp(1348): Entering test case "test_ParseFixedPoint"
test/util_tests.cpp(1348): Leaving test case "test_ParseFixedPoint"; testing time: 1553us
test/util_tests.cpp(1451): Entering test case "test_LockDirectory"
test/util_tests.cpp(1451): Leaving test case "test_LockDirectory"; testing time: 17642us
test/util_tests.cpp(1539): Entering test case "test_DirIsWritable"
test/util_tests.cpp(1539): Leaving test case "test_DirIsWritable"; testing time: 1654us
test/util_tests.cpp(1555): Entering test case "test_ToLower"
test/util_tests.cpp(1555): Leaving test case "test_ToLower"; testing time: 1394us
test/util_tests.cpp(1569): Entering test case "test_ToUpper"
test/util_tests.cpp(1569): Leaving test case "test_ToUpper"; testing time: 1524us
test/util_tests.cpp(1583): Entering test case "test_Capitalize"
test/util_tests.cpp(1583): Leaving test case "test_Capitalize"; testing time: 1676us
test/util_tests.cpp(1595): Entering test case "test_spanparsing"
test/util_tests.cpp(1595): Leaving test case "test_spanparsing"; testing time: 1555us
test/util_tests.cpp(1713): Entering test case "test_LogEscapeMessage"
test/util_tests.cpp(1713): Leaving test case "test_LogEscapeMessage"; testing time: 9562us
test/util_tests.cpp(1754): Entering test case "test_tracked_vector"
test/util_tests.cpp(1754): Leaving test case "test_tracked_vector"; testing time: 1784us
test/util_tests.cpp(35): Leaving test suite "util_tests"; testing time: 1980578us
Leaving test module "Bitcoin Core Test Suite"; testing time: 1980723us

*** 1 failure is detected in the test module "Bitcoin Core Test Suite"
Makefile:14928: recipe for target 'test/util_tests.cpp.test' failed
make[3]: *** [test/util_tests.cpp.test] Error 1
make[3]: *** Waiting for unfinished jobs....
make[3]: Leaving directory '/home/ubuntu/src/src'
Makefile:14666: recipe for target 'check-am' failed
make[2]: *** [check-am] Error 2
make[2]: Leaving directory '/home/ubuntu/src/src'
Makefile:14354: recipe for target 'check-recursive' failed
make[1]: *** [check-recursive] Error 1
make[1]: Leaving directory '/home/ubuntu/src/src'
Makefile:775: recipe for target 'check-recursive' failed
make: *** [check-recursive] Error 1

real    0m20.592s
user    0m45.667s
sys     0m3.714s
Build finished with exit code 2
#BUILD#2e2809d4-cc0b-42a6-9ab8-7808f93e20de#: 2