« part of build 15480  

Details for job 292deddb-1854-49c5-a7e1-bf5b9c6caf29


Name Linux32
Success failed
Build Time 00:01:40
Git Head 85b3656a328eb77546deb8533d10e411a0b1872d
PR 23593
Worker # 5
Base Image ubuntu1804_full_base

Pull request info

Pull# 23593

Tasks time consumption

00:00:18 - GIT_CHECKOUT
00:00:37 - APT_INSTALL
00:00:00 - RESTORE_CACHE
00:00:02 - MAKE_DEPENDS
00:00:12 - CONFIGURE

Build log tail

        module extrakeys        = yes
  module schnorrsig       = yes

  asm                     = no
  ecmult window size      = 15
  ecmult gen prec. bits   = 4

  valgrind                = no
  CC                      = gcc -m32
  CPPFLAGS                =  -I/home/ubuntu/src/depends/i686-pc-linux-gnu/include/ 
  SECP_CFLAGS             = -O2  -std=c89 -pedantic -Wno-long-long -Wnested-externs -Wshadow -Wstrict-prototypes -Wundef -Wno-overlength-strings -Wall -Wno-unused-function -Wextra -Wcast-align -fvisibility=hidden 
  CFLAGS                  = -pipe -O2 
  LDFLAGS                 = -L/home/ubuntu/src/depends/i686-pc-linux-gnu/lib -static-libstdc++

  CC_FOR_BUILD            = gcc -m32
  CPPFLAGS_FOR_BUILD      =  -I/home/ubuntu/src/depends/i686-pc-linux-gnu/include/ 
  SECP_CFLAGS_FOR_BUILD   = -O2  -std=c89 -pedantic -Wno-long-long -Wnested-externs -Wshadow -Wstrict-prototypes -Wundef -Wno-overlength-strings -Wall -Wno-unused-function -Wextra -Wcast-align -fvisibility=hidden 
  CFLAGS_FOR_BUILD        = -pipe -O2 
  LDFLAGS_FOR_BUILD       = -L/home/ubuntu/src/depends/i686-pc-linux-gnu/lib -static-libstdc++

Options used to compile and link:
  external signer = yes
  multiprocess    = no
  with experimental syscall sandbox support = no
  with libs       = yes
  with wallet     = yes
    with sqlite   = yes
    with bdb      = yes
  with gui / qt   = yes
    with qr       = yes
  with zmq        = yes
  with test       = yes
  with bench      = yes
  with upnp       = yes
  with natpmp     = yes
  use asm         = yes
  ebpf tracing    = no
  sanitizers      = 
  debug enabled   = no
  gprof enabled   = no
  werror          = no
  LTO             = no

  target os       = linux
  build os        = linux-gnu

  CC              = /usr/bin/ccache gcc -m32
  CFLAGS          = -pthread -pipe -O2 
  CPPFLAGS        =   -U_FORTIFY_SOURCE -D_FORTIFY_SOURCE=2 -I/home/ubuntu/src/depends/i686-pc-linux-gnu/include/  -DHAVE_BUILD_INFO -D_FILE_OFFSET_BITS=64 -DPROVIDE_FUZZ_MAIN_FUNCTION
  CXX             = /usr/bin/ccache g++ -m32 -std=c++17
  CXXFLAGS        =   -fdebug-prefix-map=$(abs_top_srcdir)=.  -fstack-reuse=none -Wstack-protector -fstack-protector-all     -pipe -O2  -fno-extended-identifiers -fvisibility=hidden
  LDFLAGS         =  -lpthread  -Wl,-z,relro -Wl,-z,now -Wl,-z,separate-code -pie  -L/home/ubuntu/src/depends/i686-pc-linux-gnu/lib -static-libstdc++
  ARFLAGS         = cr

real    0m12.518s
user    0m10.830s
sys     0m2.480s
+ timeblock_end CONFIGURE
++ date +%s
+ echo -e '\n###END#CONFIGURE#1637846592\n\n\n'


+ timeblock_start COMPILE_AND_INSTALL
++ date +%s
+ echo -e '\n###START#COMPILE_AND_INSTALL#1637846592\n'


+ make install -j4
Making install in src
make[1]: Entering directory '/home/ubuntu/src/src'
make[2]: Entering directory '/home/ubuntu/src/src'
  CXX      libbitcoinconsensus_la-arith_uint256.lo
  CXX      libbitcoinconsensus_la-hash.lo
  CXX      libbitcoinconsensus_la-pubkey.lo
  CXX      libbitcoinconsensus_la-uint256.lo
In file included from uint256.cpp:8:0:
./util/strencodings.h:16:10: fatal error: charconv: No such file or directory
 #include <charconv>
compilation terminated.
Makefile:12530: recipe for target 'libbitcoinconsensus_la-uint256.lo' failed
make[2]: *** [libbitcoinconsensus_la-uint256.lo] Error 1
make[2]: *** Waiting for unfinished jobs....
make[2]: Leaving directory '/home/ubuntu/src/src'
Makefile:16481: recipe for target 'install-recursive' failed
make[1]: *** [install-recursive] Error 1
make[1]: Leaving directory '/home/ubuntu/src/src'
Makefile:817: recipe for target 'install-recursive' failed
make: *** [install-recursive] Error 1

real    0m0.594s
user    0m1.247s
sys     0m0.167s
Build finished with exit code 2
#BUILD#292deddb-1854-49c5-a7e1-bf5b9c6caf29#: 2