« part of build 14354  

Details for job 0ea687b9-8cc9-4714-9bf0-b57234ea2dcc

failed

Name Linux x86_64 - system libs, clang
Success failed
Build Time 00:01:36
Git Head eb04badcd6108e17c8ec78e9c316775c334030cb
PR 23242
Worker # 3
Base Image ubuntu1804_full_base

Pull request info

Pull# 23242
Title
Head
Mergable
Changes
Comments
User

Tasks time consumption

00:00:12 - GIT_CHECKOUT
00:00:27 - APT_INSTALL
00:00:00 - RESTORE_CACHE
00:00:21 - CONFIGURE

Build log tail

        module recovery         = yes
  module extrakeys        = yes
  module schnorrsig       = yes

  asm                     = x86_64
  ecmult window size      = 15
  ecmult gen prec. bits   = 4

  valgrind                = no
  CC                      = clang-10
  CPPFLAGS                =  -DDEBUG_LOCKORDER
  SECP_CFLAGS             = -O2  -std=c89 -pedantic -Wno-long-long -Wnested-externs -Wshadow -Wstrict-prototypes -Wundef -Wno-overlength-strings -Wall -Wno-unused-function -Wextra -Wcast-align -Wconditional-uninitialized -fvisibility=hidden 
  CFLAGS                  = -g -O2
  LDFLAGS                 = 

  CC_FOR_BUILD            = clang-10
  CPPFLAGS_FOR_BUILD      =  -DDEBUG_LOCKORDER
  SECP_CFLAGS_FOR_BUILD   = -O2  -std=c89 -pedantic -Wno-long-long -Wnested-externs -Wshadow -Wstrict-prototypes -Wundef -Wno-overlength-strings -Wall -Wno-unused-function -Wextra -Wcast-align -Wconditional-uninitialized -fvisibility=hidden 
  CFLAGS_FOR_BUILD        = -g -O2
  LDFLAGS_FOR_BUILD       = 

Options used to compile and link:
  external signer = yes
  multiprocess    = no
  with experimental syscall sandbox support = no
  with libs       = yes
  with wallet     = yes
    with sqlite   = yes
    with bdb      = yes
  with gui / qt   = yes
    with qr       = yes
  with zmq        = yes
  with test       = yes
  with bench      = yes
  with upnp       = yes
  with natpmp     = no
  use asm         = yes
  ebpf tracing    = no
  sanitizers      = address,integer,undefined
  debug enabled   = no
  gprof enabled   = no
  werror          = no

  target os       = linux
  build os        = linux-gnu

  CC              = /usr/bin/ccache clang-10
  CFLAGS          = -pthread -g -O2
  CPPFLAGS        =  -fmacro-prefix-map=$(abs_srcdir)=.  -U_FORTIFY_SOURCE -D_FORTIFY_SOURCE=2 -DDEBUG_LOCKORDER -DHAVE_BUILD_INFO -D__STDC_FORMAT_MACROS -DPROVIDE_FUZZ_MAIN_FUNCTION
  CXX             = /usr/bin/ccache clang++-10 -std=c++17
  CXXFLAGS        =  -fdebug-prefix-map=$(abs_srcdir)=.  -Wstack-protector -fstack-protector-all -fcf-protection=full  -Wall -Wextra -Wgnu -Wformat -Wformat-security -Wvla -Wshadow-field -Wswitch -Wthread-safety -Wrange-loop-analysis -Wredundant-decls -Wunused-variable -Wunused-member-function -Wdate-time -Wconditional-uninitialized -Wsign-compare -Woverloaded-virtual -Wunreachable-code-loop-increment -Wimplicit-fallthrough -Wdocumentation  -Wno-unused-parameter -Wno-self-assign -Wno-unused-local-typedef   -g -O2
  LDFLAGS         = -lpthread  -Wl,-z,relro -Wl,-z,now -Wl,-z,separate-code -pie  
  ARFLAGS         = cr


real    0m20.417s
user    0m16.029s
sys     0m4.855s
+ timeblock_end CONFIGURE
++ date +%s
+ echo -e '\n###END#CONFIGURE#1634156029\n\n\n'

###END#CONFIGURE#1634156029



+ timeblock_start COMPILE_AND_INSTALL
++ date +%s
+ echo -e '\n###START#COMPILE_AND_INSTALL#1634156029\n'

###START#COMPILE_AND_INSTALL#1634156029

+ make install -j4
Making install in src
make[1]: Entering directory '/home/ubuntu/src/src'
make[2]: Entering directory '/home/ubuntu/src/src'
  CXX      libbitcoinconsensus_la-arith_uint256.lo
  CXX      libbitcoinconsensus_la-hash.lo
  CXX      libbitcoinconsensus_la-pubkey.lo
  CXX      libbitcoinconsensus_la-uint256.lo
In file included from uint256.cpp:8:
./util/strencodings.h:16:10: fatal error: 'charconv' file not found
#include <charconv>
         ^~~~~~~~~~
1 error generated.
Makefile:11858: recipe for target 'libbitcoinconsensus_la-uint256.lo' failed
make[2]: *** [libbitcoinconsensus_la-uint256.lo] Error 1
make[2]: *** Waiting for unfinished jobs....
make[2]: Leaving directory '/home/ubuntu/src/src'
Makefile:15652: recipe for target 'install-recursive' failed
make[1]: *** [install-recursive] Error 1
make[1]: Leaving directory '/home/ubuntu/src/src'
Makefile:820: recipe for target 'install-recursive' failed
make: *** [install-recursive] Error 1

real    0m3.265s
user    0m7.148s
sys     0m0.408s
Build finished with exit code 2
#BUILD#0ea687b9-8cc9-4714-9bf0-b57234ea2dcc#: 2