« part of build 10088  

Details for job 04209c04-b2e3-46e4-8d66-6e08d830a361

failed

Name macOS
Success failed
Build Time 00:11:32
Git Head 39e19713cd6594f93db835e8ef7eef5824a9ba02
PR 21845
Worker # 3
Base Image ubuntu1804_full_base

Pull request info

Pull# 21845
Title
Head
Mergable
Changes
Comments
User

Tasks time consumption

00:00:12 - GIT_CHECKOUT
00:00:57 - APT_INSTALL
00:00:00 - RESTORE_CACHE

Build log tail

      In file included from libs/test/src/unit_test_monitor.cpp:16:
In file included from ./boost/test/impl/unit_test_monitor.ipp:20:
In file included from ./boost/test/unit_test_monitor.hpp:18:
In file included from ./boost/test/execution_monitor.hpp:17:
In file included from ./boost/test/detail/global_typedef.hpp:15:
In file included from ./boost/test/utils/basic_cstring/basic_cstring.hpp:20:
In file included from ./boost/test/utils/basic_cstring/basic_cstring_fwd.hpp:19:
In file included from ./boost/test/detail/config.hpp:16:
In file included from ./boost/config.hpp:44:
./boost/config/detail/select_stdlib_config.hpp:18:12: fatal error: 'cstddef' file not found
#  include <cstddef>
           ^~~~~~~~~
1 error generated.
...failed clang-linux.compile.c++.without-pch bin.v2/libs/test/build/clang-linux-10.0.1/release/link-static/target-os-darwin/threading-multi/visibility-hidden/unit_test_monitor.o...
clang-linux.compile.c++.without-pch bin.v2/libs/test/build/clang-linux-10.0.1/release/link-static/target-os-darwin/threading-multi/visibility-hidden/junit_log_formatter.o

  "env" "-u" "C_INCLUDE_PATH" "-u" "CPLUS_INCLUDE_PATH" "-u" "OBJC_INCLUDE_PATH" "-u" "OBJCPLUS_INCLUDE_PATH" "-u" "CPATH" "-u" "LIBRARY_PATH" "/home/ubuntu/src/depends/x86_64-apple-darwin16/native/bin/clang++" "--target=x86_64-apple-darwin16" "-mmacosx-version-min=10.14" "-B/home/ubuntu/src/depends/x86_64-apple-darwin16/native/bin" "-mlinker-version=609" "-isysroot/home/ubuntu/src/depends/SDKs/Xcode-12.1-12A7403-extracted-SDK-with-libcxx-headers" "-stdlib=libc++" "-stdlib++-isystem/home/ubuntu/src/depends/SDKs/Xcode-12.1-12A7403-extracted-SDK-with-libcxx-headers/usr/include/c++/v1" "-Xclang" "-internal-externc-isystem/home/ubuntu/src/depends/x86_64-apple-darwin16/native/lib/clang/10.0.1/include" "-Xclang" "-internal-externc-isystem/home/ubuntu/src/depends/SDKs/Xcode-12.1-12A7403-extracted-SDK-with-libcxx-headers/usr/include" -c -x c++ -fvisibility-inlines-hidden -std=c++17 -fvisibility=hidden     -m64 -O3 -Wall -fvisibility=hidden -Wno-inline   -I/home/ubuntu/src/depends/x86_64-apple-darwin16/include     -Wno-c99-extensions -Wno-variadic-macros -DBOOST_ALL_NO_LIB=1 -DNDEBUG -I"." -o "bin.v2/libs/test/build/clang-linux-10.0.1/release/link-static/target-os-darwin/threading-multi/visibility-hidden/junit_log_formatter.o" "libs/test/src/junit_log_formatter.cpp"

clang: warning: no such sysroot directory: '/home/ubuntu/src/depends/SDKs/Xcode-12.1-12A7403-extracted-SDK-with-libcxx-headers' [-Wmissing-sysroot]
In file included from libs/test/src/junit_log_formatter.cpp:11:
In file included from ./boost/test/impl/junit_log_formatter.ipp:16:
In file included from ./boost/test/output/junit_log_formatter.hpp:16:
In file included from ./boost/test/detail/global_typedef.hpp:15:
In file included from ./boost/test/utils/basic_cstring/basic_cstring.hpp:20:
In file included from ./boost/test/utils/basic_cstring/basic_cstring_fwd.hpp:19:
In file included from ./boost/test/detail/config.hpp:16:
In file included from ./boost/config.hpp:44:
./boost/config/detail/select_stdlib_config.hpp:18:12: fatal error: 'cstddef' file not found
#  include <cstddef>
           ^~~~~~~~~
1 error generated.
...failed clang-linux.compile.c++.without-pch bin.v2/libs/test/build/clang-linux-10.0.1/release/link-static/target-os-darwin/threading-multi/visibility-hidden/junit_log_formatter.o...
clang-linux.compile.c++.without-pch bin.v2/libs/test/build/clang-linux-10.0.1/release/link-static/target-os-darwin/threading-multi/visibility-hidden/xml_log_formatter.o

  "env" "-u" "C_INCLUDE_PATH" "-u" "CPLUS_INCLUDE_PATH" "-u" "OBJC_INCLUDE_PATH" "-u" "OBJCPLUS_INCLUDE_PATH" "-u" "CPATH" "-u" "LIBRARY_PATH" "/home/ubuntu/src/depends/x86_64-apple-darwin16/native/bin/clang++" "--target=x86_64-apple-darwin16" "-mmacosx-version-min=10.14" "-B/home/ubuntu/src/depends/x86_64-apple-darwin16/native/bin" "-mlinker-version=609" "-isysroot/home/ubuntu/src/depends/SDKs/Xcode-12.1-12A7403-extracted-SDK-with-libcxx-headers" "-stdlib=libc++" "-stdlib++-isystem/home/ubuntu/src/depends/SDKs/Xcode-12.1-12A7403-extracted-SDK-with-libcxx-headers/usr/include/c++/v1" "-Xclang" "-internal-externc-isystem/home/ubuntu/src/depends/x86_64-apple-darwin16/native/lib/clang/10.0.1/include" "-Xclang" "-internal-externc-isystem/home/ubuntu/src/depends/SDKs/Xcode-12.1-12A7403-extracted-SDK-with-libcxx-headers/usr/include" -c -x c++ -fvisibility-inlines-hidden -std=c++17 -fvisibility=hidden     -m64 -O3 -Wall -fvisibility=hidden -Wno-inline   -I/home/ubuntu/src/depends/x86_64-apple-darwin16/include     -Wno-c99-extensions -Wno-variadic-macros -DBOOST_ALL_NO_LIB=1 -DNDEBUG -I"." -o "bin.v2/libs/test/build/clang-linux-10.0.1/release/link-static/target-os-darwin/threading-multi/visibility-hidden/xml_log_formatter.o" "libs/test/src/xml_log_formatter.cpp"

clang: warning: no such sysroot directory: '/home/ubuntu/src/depends/SDKs/Xcode-12.1-12A7403-extracted-SDK-with-libcxx-headers' [-Wmissing-sysroot]
In file included from libs/test/src/xml_log_formatter.cpp:16:
In file included from ./boost/test/impl/xml_log_formatter.ipp:19:
In file included from ./boost/test/output/xml_log_formatter.hpp:19:
In file included from ./boost/test/detail/global_typedef.hpp:15:
In file included from ./boost/test/utils/basic_cstring/basic_cstring.hpp:20:
In file included from ./boost/test/utils/basic_cstring/basic_cstring_fwd.hpp:19:
In file included from ./boost/test/detail/config.hpp:16:
In file included from ./boost/config.hpp:44:
./boost/config/detail/select_stdlib_config.hpp:18:12: fatal error: 'cstddef' file not found
#  include <cstddef>
           ^~~~~~~~~
1 error generated.
...failed clang-linux.compile.c++.without-pch bin.v2/libs/test/build/clang-linux-10.0.1/release/link-static/target-os-darwin/threading-multi/visibility-hidden/xml_log_formatter.o...
clang-linux.compile.c++.without-pch bin.v2/libs/test/build/clang-linux-10.0.1/release/link-static/target-os-darwin/threading-multi/visibility-hidden/unit_test_parameters.o

  "env" "-u" "C_INCLUDE_PATH" "-u" "CPLUS_INCLUDE_PATH" "-u" "OBJC_INCLUDE_PATH" "-u" "OBJCPLUS_INCLUDE_PATH" "-u" "CPATH" "-u" "LIBRARY_PATH" "/home/ubuntu/src/depends/x86_64-apple-darwin16/native/bin/clang++" "--target=x86_64-apple-darwin16" "-mmacosx-version-min=10.14" "-B/home/ubuntu/src/depends/x86_64-apple-darwin16/native/bin" "-mlinker-version=609" "-isysroot/home/ubuntu/src/depends/SDKs/Xcode-12.1-12A7403-extracted-SDK-with-libcxx-headers" "-stdlib=libc++" "-stdlib++-isystem/home/ubuntu/src/depends/SDKs/Xcode-12.1-12A7403-extracted-SDK-with-libcxx-headers/usr/include/c++/v1" "-Xclang" "-internal-externc-isystem/home/ubuntu/src/depends/x86_64-apple-darwin16/native/lib/clang/10.0.1/include" "-Xclang" "-internal-externc-isystem/home/ubuntu/src/depends/SDKs/Xcode-12.1-12A7403-extracted-SDK-with-libcxx-headers/usr/include" -c -x c++ -fvisibility-inlines-hidden -std=c++17 -fvisibility=hidden     -m64 -O3 -Wall -fvisibility=hidden -Wno-inline   -I/home/ubuntu/src/depends/x86_64-apple-darwin16/include     -Wno-c99-extensions -Wno-variadic-macros -DBOOST_ALL_NO_LIB=1 -DNDEBUG -I"." -o "bin.v2/libs/test/build/clang-linux-10.0.1/release/link-static/target-os-darwin/threading-multi/visibility-hidden/unit_test_parameters.o" "libs/test/src/unit_test_parameters.cpp"

clang: warning: no such sysroot directory: '/home/ubuntu/src/depends/SDKs/Xcode-12.1-12A7403-extracted-SDK-with-libcxx-headers' [-Wmissing-sysroot]
In file included from libs/test/src/unit_test_parameters.cpp:16:
In file included from ./boost/test/impl/unit_test_parameters.ipp:22:
In file included from ./boost/test/unit_test_parameters.hpp:18:
In file included from ./boost/test/detail/global_typedef.hpp:15:
In file included from ./boost/test/utils/basic_cstring/basic_cstring.hpp:20:
In file included from ./boost/test/utils/basic_cstring/basic_cstring_fwd.hpp:19:
In file included from ./boost/test/detail/config.hpp:16:
In file included from ./boost/config.hpp:44:
./boost/config/detail/select_stdlib_config.hpp:18:12: fatal error: 'cstddef' file not found
#  include <cstddef>
           ^~~~~~~~~
1 error generated.
...failed clang-linux.compile.c++.without-pch bin.v2/libs/test/build/clang-linux-10.0.1/release/link-static/target-os-darwin/threading-multi/visibility-hidden/unit_test_parameters.o...
clang-linux.compile.c++.without-pch bin.v2/libs/test/build/clang-linux-10.0.1/release/link-static/target-os-darwin/threading-multi/visibility-hidden/xml_report_formatter.o

  "env" "-u" "C_INCLUDE_PATH" "-u" "CPLUS_INCLUDE_PATH" "-u" "OBJC_INCLUDE_PATH" "-u" "OBJCPLUS_INCLUDE_PATH" "-u" "CPATH" "-u" "LIBRARY_PATH" "/home/ubuntu/src/depends/x86_64-apple-darwin16/native/bin/clang++" "--target=x86_64-apple-darwin16" "-mmacosx-version-min=10.14" "-B/home/ubuntu/src/depends/x86_64-apple-darwin16/native/bin" "-mlinker-version=609" "-isysroot/home/ubuntu/src/depends/SDKs/Xcode-12.1-12A7403-extracted-SDK-with-libcxx-headers" "-stdlib=libc++" "-stdlib++-isystem/home/ubuntu/src/depends/SDKs/Xcode-12.1-12A7403-extracted-SDK-with-libcxx-headers/usr/include/c++/v1" "-Xclang" "-internal-externc-isystem/home/ubuntu/src/depends/x86_64-apple-darwin16/native/lib/clang/10.0.1/include" "-Xclang" "-internal-externc-isystem/home/ubuntu/src/depends/SDKs/Xcode-12.1-12A7403-extracted-SDK-with-libcxx-headers/usr/include" -c -x c++ -fvisibility-inlines-hidden -std=c++17 -fvisibility=hidden     -m64 -O3 -Wall -fvisibility=hidden -Wno-inline   -I/home/ubuntu/src/depends/x86_64-apple-darwin16/include     -Wno-c99-extensions -Wno-variadic-macros -DBOOST_ALL_NO_LIB=1 -DNDEBUG -I"." -o "bin.v2/libs/test/build/clang-linux-10.0.1/release/link-static/target-os-darwin/threading-multi/visibility-hidden/xml_report_formatter.o" "libs/test/src/xml_report_formatter.cpp"

clang: warning: no such sysroot directory: '/home/ubuntu/src/depends/SDKs/Xcode-12.1-12A7403-extracted-SDK-with-libcxx-headers' [-Wmissing-sysroot]
In file included from libs/test/src/xml_report_formatter.cpp:16:
In file included from ./boost/test/impl/xml_report_formatter.ipp:19:
In file included from ./boost/test/results_collector.hpp:19:
In file included from ./boost/test/tree/observer.hpp:17:
In file included from ./boost/test/detail/global_typedef.hpp:15:
In file included from ./boost/test/utils/basic_cstring/basic_cstring.hpp:20:
In file included from ./boost/test/utils/basic_cstring/basic_cstring_fwd.hpp:19:
In file included from ./boost/test/detail/config.hpp:16:
In file included from ./boost/config.hpp:44:
./boost/config/detail/select_stdlib_config.hpp:18:12: fatal error: 'cstddef' file not found
#  include <cstddef>
           ^~~~~~~~~
1 error generated.
...failed clang-linux.compile.c++.without-pch bin.v2/libs/test/build/clang-linux-10.0.1/release/link-static/target-os-darwin/threading-multi/visibility-hidden/xml_report_formatter.o...
...skipped <pbin.v2/libs/test/build/clang-linux-10.0.1/release/link-static/target-os-darwin/threading-multi/visibility-hidden>libboost_test_exec_monitor-mt-x64.a(clean) for lack of <pbin.v2/libs/test/build/clang-linux-10.0.1/release/link-static/target-os-darwin/threading-multi/visibility-hidden>compiler_log_formatter.o...
...skipped <pbin.v2/libs/test/build/clang-linux-10.0.1/release/link-static/target-os-darwin/threading-multi/visibility-hidden>libboost_test_exec_monitor-mt-x64.a for lack of <pbin.v2/libs/test/build/clang-linux-10.0.1/release/link-static/target-os-darwin/threading-multi/visibility-hidden>compiler_log_formatter.o...
...skipped <p/home/ubuntu/src/depends/work/build/x86_64-apple-darwin16/boost/1_71_0-06c16998448/stage/lib>libboost_test_exec_monitor-mt-x64.a for lack of <pbin.v2/libs/test/build/clang-linux-10.0.1/release/link-static/target-os-darwin/threading-multi/visibility-hidden>libboost_test_exec_monitor-mt-x64.a...
...skipped <pbin.v2/libs/test/build/clang-linux-10.0.1/release/link-static/target-os-darwin/threading-multi/visibility-hidden>libboost_unit_test_framework-mt-x64.a(clean) for lack of <pbin.v2/libs/test/build/clang-linux-10.0.1/release/link-static/target-os-darwin/threading-multi/visibility-hidden>compiler_log_formatter.o...
...skipped <pbin.v2/libs/test/build/clang-linux-10.0.1/release/link-static/target-os-darwin/threading-multi/visibility-hidden>libboost_unit_test_framework-mt-x64.a for lack of <pbin.v2/libs/test/build/clang-linux-10.0.1/release/link-static/target-os-darwin/threading-multi/visibility-hidden>compiler_log_formatter.o...
...skipped <p/home/ubuntu/src/depends/work/build/x86_64-apple-darwin16/boost/1_71_0-06c16998448/stage/lib>libboost_unit_test_framework-mt-x64.a for lack of <pbin.v2/libs/test/build/clang-linux-10.0.1/release/link-static/target-os-darwin/threading-multi/visibility-hidden>libboost_unit_test_framework-mt-x64.a...
...failed updating 30 targets...
...skipped 15 targets...
...updated 27 targets...
funcs.mk:279: recipe for target '/home/ubuntu/src/depends/work/build/x86_64-apple-darwin16/boost/1_71_0-06c16998448/./.stamp_built' failed
make: *** [/home/ubuntu/src/depends/work/build/x86_64-apple-darwin16/boost/1_71_0-06c16998448/./.stamp_built] Error 1
Build finished with exit code 2
#BUILD#04209c04-b2e3-46e4-8d66-6e08d830a361#: 2