« part of build 15469  

Details for job 00f2da00-98fd-469e-a690-4d7041aeb813

failed

Name Win64
Success failed
Build Time 00:01:27
Git Head 791dd1f41ed787516169a33a590ca42b53f8b8fb
Branch master
Worker # 2
Base Image ubuntu1804_full_base

Tasks time consumption

00:00:19 - GIT_CHECKOUT
00:00:10 - APT_INSTALL
00:00:00 - RESTORE_CACHE

Build log tail

      
x86_64-w64-mingw32-g++: error: unrecognized command line option ‘-fcf-protection=full’; did you mean ‘-fstack-protector-all’?
...failed gcc.compile.c++ bin.v2/libs/test/build/gcc-7.3/release/address-model-64/architecture-x86/link-static/target-os-windows/threading-multi/visibility-hidden/plain_report_formatter.o...
gcc.compile.c++ bin.v2/libs/test/build/gcc-7.3/release/address-model-64/architecture-x86/link-static/target-os-windows/threading-multi/visibility-hidden/progress_monitor.o

    "x86_64-w64-mingw32-g++"   -fvisibility-inlines-hidden -pipe -O2 -std=c++17   -fcf-protection=full   -m64 -mthreads -O3 -finline-functions -Wno-inline -Wall -fvisibility=hidden   -I/home/ubuntu/src/depends/x86_64-w64-mingw32/include      -DBOOST_ALL_NO_LIB=1 -DNDEBUG  -I"." -c -o "bin.v2/libs/test/build/gcc-7.3/release/address-model-64/architecture-x86/link-static/target-os-windows/threading-multi/visibility-hidden/progress_monitor.o" "libs/test/src/progress_monitor.cpp"

x86_64-w64-mingw32-g++: error: unrecognized command line option ‘-fcf-protection=full’; did you mean ‘-fstack-protector-all’?
...failed gcc.compile.c++ bin.v2/libs/test/build/gcc-7.3/release/address-model-64/architecture-x86/link-static/target-os-windows/threading-multi/visibility-hidden/progress_monitor.o...
gcc.compile.c++ bin.v2/libs/test/build/gcc-7.3/release/address-model-64/architecture-x86/link-static/target-os-windows/threading-multi/visibility-hidden/results_collector.o

    "x86_64-w64-mingw32-g++"   -fvisibility-inlines-hidden -pipe -O2 -std=c++17   -fcf-protection=full   -m64 -mthreads -O3 -finline-functions -Wno-inline -Wall -fvisibility=hidden   -I/home/ubuntu/src/depends/x86_64-w64-mingw32/include      -DBOOST_ALL_NO_LIB=1 -DNDEBUG  -I"." -c -o "bin.v2/libs/test/build/gcc-7.3/release/address-model-64/architecture-x86/link-static/target-os-windows/threading-multi/visibility-hidden/results_collector.o" "libs/test/src/results_collector.cpp"

x86_64-w64-mingw32-g++: error: unrecognized command line option ‘-fcf-protection=full’; did you mean ‘-fstack-protector-all’?
...failed gcc.compile.c++ bin.v2/libs/test/build/gcc-7.3/release/address-model-64/architecture-x86/link-static/target-os-windows/threading-multi/visibility-hidden/results_collector.o...
gcc.compile.c++ bin.v2/libs/test/build/gcc-7.3/release/address-model-64/architecture-x86/link-static/target-os-windows/threading-multi/visibility-hidden/results_reporter.o

    "x86_64-w64-mingw32-g++"   -fvisibility-inlines-hidden -pipe -O2 -std=c++17   -fcf-protection=full   -m64 -mthreads -O3 -finline-functions -Wno-inline -Wall -fvisibility=hidden   -I/home/ubuntu/src/depends/x86_64-w64-mingw32/include      -DBOOST_ALL_NO_LIB=1 -DNDEBUG  -I"." -c -o "bin.v2/libs/test/build/gcc-7.3/release/address-model-64/architecture-x86/link-static/target-os-windows/threading-multi/visibility-hidden/results_reporter.o" "libs/test/src/results_reporter.cpp"

x86_64-w64-mingw32-g++: error: unrecognized command line option ‘-fcf-protection=full’; did you mean ‘-fstack-protector-all’?
...failed gcc.compile.c++ bin.v2/libs/test/build/gcc-7.3/release/address-model-64/architecture-x86/link-static/target-os-windows/threading-multi/visibility-hidden/results_reporter.o...
gcc.compile.c++ bin.v2/libs/test/build/gcc-7.3/release/address-model-64/architecture-x86/link-static/target-os-windows/threading-multi/visibility-hidden/test_framework_init_observer.o

    "x86_64-w64-mingw32-g++"   -fvisibility-inlines-hidden -pipe -O2 -std=c++17   -fcf-protection=full   -m64 -mthreads -O3 -finline-functions -Wno-inline -Wall -fvisibility=hidden   -I/home/ubuntu/src/depends/x86_64-w64-mingw32/include      -DBOOST_ALL_NO_LIB=1 -DNDEBUG  -I"." -c -o "bin.v2/libs/test/build/gcc-7.3/release/address-model-64/architecture-x86/link-static/target-os-windows/threading-multi/visibility-hidden/test_framework_init_observer.o" "libs/test/src/test_framework_init_observer.cpp"

x86_64-w64-mingw32-g++: error: unrecognized command line option ‘-fcf-protection=full’; did you mean ‘-fstack-protector-all’?
...failed gcc.compile.c++ bin.v2/libs/test/build/gcc-7.3/release/address-model-64/architecture-x86/link-static/target-os-windows/threading-multi/visibility-hidden/test_framework_init_observer.o...
gcc.compile.c++ bin.v2/libs/test/build/gcc-7.3/release/address-model-64/architecture-x86/link-static/target-os-windows/threading-multi/visibility-hidden/test_main.o

    "x86_64-w64-mingw32-g++"   -fvisibility-inlines-hidden -pipe -O2 -std=c++17   -fcf-protection=full   -m64 -mthreads -O3 -finline-functions -Wno-inline -Wall -fvisibility=hidden   -I/home/ubuntu/src/depends/x86_64-w64-mingw32/include      -DBOOST_ALL_NO_LIB=1 -DNDEBUG  -I"." -c -o "bin.v2/libs/test/build/gcc-7.3/release/address-model-64/architecture-x86/link-static/target-os-windows/threading-multi/visibility-hidden/test_main.o" "libs/test/src/test_main.cpp"

x86_64-w64-mingw32-g++: error: unrecognized command line option ‘-fcf-protection=full’; did you mean ‘-fstack-protector-all’?
...failed gcc.compile.c++ bin.v2/libs/test/build/gcc-7.3/release/address-model-64/architecture-x86/link-static/target-os-windows/threading-multi/visibility-hidden/test_main.o...
gcc.compile.c++ bin.v2/libs/test/build/gcc-7.3/release/address-model-64/architecture-x86/link-static/target-os-windows/threading-multi/visibility-hidden/test_tools.o

    "x86_64-w64-mingw32-g++"   -fvisibility-inlines-hidden -pipe -O2 -std=c++17   -fcf-protection=full   -m64 -mthreads -O3 -finline-functions -Wno-inline -Wall -fvisibility=hidden   -I/home/ubuntu/src/depends/x86_64-w64-mingw32/include      -DBOOST_ALL_NO_LIB=1 -DNDEBUG  -I"." -c -o "bin.v2/libs/test/build/gcc-7.3/release/address-model-64/architecture-x86/link-static/target-os-windows/threading-multi/visibility-hidden/test_tools.o" "libs/test/src/test_tools.cpp"

x86_64-w64-mingw32-g++: error: unrecognized command line option ‘-fcf-protection=full’; did you mean ‘-fstack-protector-all’?
...failed gcc.compile.c++ bin.v2/libs/test/build/gcc-7.3/release/address-model-64/architecture-x86/link-static/target-os-windows/threading-multi/visibility-hidden/test_tools.o...
gcc.compile.c++ bin.v2/libs/test/build/gcc-7.3/release/address-model-64/architecture-x86/link-static/target-os-windows/threading-multi/visibility-hidden/test_tree.o

    "x86_64-w64-mingw32-g++"   -fvisibility-inlines-hidden -pipe -O2 -std=c++17   -fcf-protection=full   -m64 -mthreads -O3 -finline-functions -Wno-inline -Wall -fvisibility=hidden   -I/home/ubuntu/src/depends/x86_64-w64-mingw32/include      -DBOOST_ALL_NO_LIB=1 -DNDEBUG  -I"." -c -o "bin.v2/libs/test/build/gcc-7.3/release/address-model-64/architecture-x86/link-static/target-os-windows/threading-multi/visibility-hidden/test_tree.o" "libs/test/src/test_tree.cpp"

x86_64-w64-mingw32-g++: error: unrecognized command line option ‘-fcf-protection=full’; did you mean ‘-fstack-protector-all’?
...failed gcc.compile.c++ bin.v2/libs/test/build/gcc-7.3/release/address-model-64/architecture-x86/link-static/target-os-windows/threading-multi/visibility-hidden/test_tree.o...
gcc.compile.c++ bin.v2/libs/test/build/gcc-7.3/release/address-model-64/architecture-x86/link-static/target-os-windows/threading-multi/visibility-hidden/unit_test_log.o

    "x86_64-w64-mingw32-g++"   -fvisibility-inlines-hidden -pipe -O2 -std=c++17   -fcf-protection=full   -m64 -mthreads -O3 -finline-functions -Wno-inline -Wall -fvisibility=hidden   -I/home/ubuntu/src/depends/x86_64-w64-mingw32/include      -DBOOST_ALL_NO_LIB=1 -DNDEBUG  -I"." -c -o "bin.v2/libs/test/build/gcc-7.3/release/address-model-64/architecture-x86/link-static/target-os-windows/threading-multi/visibility-hidden/unit_test_log.o" "libs/test/src/unit_test_log.cpp"

x86_64-w64-mingw32-g++: error: unrecognized command line option ‘-fcf-protection=full’; did you mean ‘-fstack-protector-all’?
...failed gcc.compile.c++ bin.v2/libs/test/build/gcc-7.3/release/address-model-64/architecture-x86/link-static/target-os-windows/threading-multi/visibility-hidden/unit_test_log.o...
gcc.compile.c++ bin.v2/libs/test/build/gcc-7.3/release/address-model-64/architecture-x86/link-static/target-os-windows/threading-multi/visibility-hidden/unit_test_main.o

    "x86_64-w64-mingw32-g++"   -fvisibility-inlines-hidden -pipe -O2 -std=c++17   -fcf-protection=full   -m64 -mthreads -O3 -finline-functions -Wno-inline -Wall -fvisibility=hidden   -I/home/ubuntu/src/depends/x86_64-w64-mingw32/include      -DBOOST_ALL_NO_LIB=1 -DNDEBUG  -I"." -c -o "bin.v2/libs/test/build/gcc-7.3/release/address-model-64/architecture-x86/link-static/target-os-windows/threading-multi/visibility-hidden/unit_test_main.o" "libs/test/src/unit_test_main.cpp"

x86_64-w64-mingw32-g++: error: unrecognized command line option ‘-fcf-protection=full’; did you mean ‘-fstack-protector-all’?
...failed gcc.compile.c++ bin.v2/libs/test/build/gcc-7.3/release/address-model-64/architecture-x86/link-static/target-os-windows/threading-multi/visibility-hidden/unit_test_main.o...
gcc.compile.c++ bin.v2/libs/test/build/gcc-7.3/release/address-model-64/architecture-x86/link-static/target-os-windows/threading-multi/visibility-hidden/unit_test_parameters.o

    "x86_64-w64-mingw32-g++"   -fvisibility-inlines-hidden -pipe -O2 -std=c++17   -fcf-protection=full   -m64 -mthreads -O3 -finline-functions -Wno-inline -Wall -fvisibility=hidden   -I/home/ubuntu/src/depends/x86_64-w64-mingw32/include      -DBOOST_ALL_NO_LIB=1 -DNDEBUG  -I"." -c -o "bin.v2/libs/test/build/gcc-7.3/release/address-model-64/architecture-x86/link-static/target-os-windows/threading-multi/visibility-hidden/unit_test_parameters.o" "libs/test/src/unit_test_parameters.cpp"

x86_64-w64-mingw32-g++: error: unrecognized command line option ‘-fcf-protection=full’; did you mean ‘-fstack-protector-all’?
...failed gcc.compile.c++ bin.v2/libs/test/build/gcc-7.3/release/address-model-64/architecture-x86/link-static/target-os-windows/threading-multi/visibility-hidden/unit_test_parameters.o...
gcc.compile.c++ bin.v2/libs/test/build/gcc-7.3/release/address-model-64/architecture-x86/link-static/target-os-windows/threading-multi/visibility-hidden/unit_test_monitor.o

    "x86_64-w64-mingw32-g++"   -fvisibility-inlines-hidden -pipe -O2 -std=c++17   -fcf-protection=full   -m64 -mthreads -O3 -finline-functions -Wno-inline -Wall -fvisibility=hidden   -I/home/ubuntu/src/depends/x86_64-w64-mingw32/include      -DBOOST_ALL_NO_LIB=1 -DNDEBUG  -I"." -c -o "bin.v2/libs/test/build/gcc-7.3/release/address-model-64/architecture-x86/link-static/target-os-windows/threading-multi/visibility-hidden/unit_test_monitor.o" "libs/test/src/unit_test_monitor.cpp"

x86_64-w64-mingw32-g++: error: unrecognized command line option ‘-fcf-protection=full’; did you mean ‘-fstack-protector-all’?
...failed gcc.compile.c++ bin.v2/libs/test/build/gcc-7.3/release/address-model-64/architecture-x86/link-static/target-os-windows/threading-multi/visibility-hidden/unit_test_monitor.o...
gcc.compile.c++ bin.v2/libs/test/build/gcc-7.3/release/address-model-64/architecture-x86/link-static/target-os-windows/threading-multi/visibility-hidden/xml_log_formatter.o

    "x86_64-w64-mingw32-g++"   -fvisibility-inlines-hidden -pipe -O2 -std=c++17   -fcf-protection=full   -m64 -mthreads -O3 -finline-functions -Wno-inline -Wall -fvisibility=hidden   -I/home/ubuntu/src/depends/x86_64-w64-mingw32/include      -DBOOST_ALL_NO_LIB=1 -DNDEBUG  -I"." -c -o "bin.v2/libs/test/build/gcc-7.3/release/address-model-64/architecture-x86/link-static/target-os-windows/threading-multi/visibility-hidden/xml_log_formatter.o" "libs/test/src/xml_log_formatter.cpp"

x86_64-w64-mingw32-g++: error: unrecognized command line option ‘-fcf-protection=full’; did you mean ‘-fstack-protector-all’?
...failed gcc.compile.c++ bin.v2/libs/test/build/gcc-7.3/release/address-model-64/architecture-x86/link-static/target-os-windows/threading-multi/visibility-hidden/xml_log_formatter.o...
gcc.compile.c++ bin.v2/libs/test/build/gcc-7.3/release/address-model-64/architecture-x86/link-static/target-os-windows/threading-multi/visibility-hidden/junit_log_formatter.o

    "x86_64-w64-mingw32-g++"   -fvisibility-inlines-hidden -pipe -O2 -std=c++17   -fcf-protection=full   -m64 -mthreads -O3 -finline-functions -Wno-inline -Wall -fvisibility=hidden   -I/home/ubuntu/src/depends/x86_64-w64-mingw32/include      -DBOOST_ALL_NO_LIB=1 -DNDEBUG  -I"." -c -o "bin.v2/libs/test/build/gcc-7.3/release/address-model-64/architecture-x86/link-static/target-os-windows/threading-multi/visibility-hidden/junit_log_formatter.o" "libs/test/src/junit_log_formatter.cpp"

x86_64-w64-mingw32-g++: error: unrecognized command line option ‘-fcf-protection=full’; did you mean ‘-fstack-protector-all’?
...failed gcc.compile.c++ bin.v2/libs/test/build/gcc-7.3/release/address-model-64/architecture-x86/link-static/target-os-windows/threading-multi/visibility-hidden/junit_log_formatter.o...
gcc.compile.c++ bin.v2/libs/test/build/gcc-7.3/release/address-model-64/architecture-x86/link-static/target-os-windows/threading-multi/visibility-hidden/xml_report_formatter.o

    "x86_64-w64-mingw32-g++"   -fvisibility-inlines-hidden -pipe -O2 -std=c++17   -fcf-protection=full   -m64 -mthreads -O3 -finline-functions -Wno-inline -Wall -fvisibility=hidden   -I/home/ubuntu/src/depends/x86_64-w64-mingw32/include      -DBOOST_ALL_NO_LIB=1 -DNDEBUG  -I"." -c -o "bin.v2/libs/test/build/gcc-7.3/release/address-model-64/architecture-x86/link-static/target-os-windows/threading-multi/visibility-hidden/xml_report_formatter.o" "libs/test/src/xml_report_formatter.cpp"

x86_64-w64-mingw32-g++: error: unrecognized command line option ‘-fcf-protection=full’; did you mean ‘-fstack-protector-all’?
...failed gcc.compile.c++ bin.v2/libs/test/build/gcc-7.3/release/address-model-64/architecture-x86/link-static/target-os-windows/threading-multi/visibility-hidden/xml_report_formatter.o...
...skipped <pbin.v2/libs/test/build/gcc-7.3/release/address-model-64/architecture-x86/link-static/target-os-windows/threading-multi/visibility-hidden>libboost_test_exec_monitor-mt-s-x64.a(clean) for lack of <pbin.v2/libs/test/build/gcc-7.3/release/address-model-64/architecture-x86/link-static/target-os-windows/threading-multi/visibility-hidden>compiler_log_formatter.o...
...skipped <pbin.v2/libs/test/build/gcc-7.3/release/address-model-64/architecture-x86/link-static/target-os-windows/threading-multi/visibility-hidden>libboost_test_exec_monitor-mt-s-x64.a for lack of <pbin.v2/libs/test/build/gcc-7.3/release/address-model-64/architecture-x86/link-static/target-os-windows/threading-multi/visibility-hidden>compiler_log_formatter.o...
...skipped <p/home/ubuntu/src/depends/work/build/x86_64-w64-mingw32/boost/1_71_0-f50f2b41c54/stage/lib>libboost_test_exec_monitor-mt-s-x64.a for lack of <pbin.v2/libs/test/build/gcc-7.3/release/address-model-64/architecture-x86/link-static/target-os-windows/threading-multi/visibility-hidden>libboost_test_exec_monitor-mt-s-x64.a...
...skipped <pbin.v2/libs/test/build/gcc-7.3/release/address-model-64/architecture-x86/link-static/target-os-windows/threading-multi/visibility-hidden>libboost_unit_test_framework-mt-s-x64.a(clean) for lack of <pbin.v2/libs/test/build/gcc-7.3/release/address-model-64/architecture-x86/link-static/target-os-windows/threading-multi/visibility-hidden>compiler_log_formatter.o...
...skipped <pbin.v2/libs/test/build/gcc-7.3/release/address-model-64/architecture-x86/link-static/target-os-windows/threading-multi/visibility-hidden>libboost_unit_test_framework-mt-s-x64.a for lack of <pbin.v2/libs/test/build/gcc-7.3/release/address-model-64/architecture-x86/link-static/target-os-windows/threading-multi/visibility-hidden>compiler_log_formatter.o...
...skipped <p/home/ubuntu/src/depends/work/build/x86_64-w64-mingw32/boost/1_71_0-f50f2b41c54/stage/lib>libboost_unit_test_framework-mt-s-x64.a for lack of <pbin.v2/libs/test/build/gcc-7.3/release/address-model-64/architecture-x86/link-static/target-os-windows/threading-multi/visibility-hidden>libboost_unit_test_framework-mt-s-x64.a...
...failed updating 30 targets...
...skipped 15 targets...
...updated 33 targets...
funcs.mk:279: recipe for target '/home/ubuntu/src/depends/work/build/x86_64-w64-mingw32/boost/1_71_0-f50f2b41c54/./.stamp_built' failed
make: *** [/home/ubuntu/src/depends/work/build/x86_64-w64-mingw32/boost/1_71_0-f50f2b41c54/./.stamp_built] Error 1
Build finished with exit code 2
#BUILD#00f2da00-98fd-469e-a690-4d7041aeb813#: 2